DKMS Output of update to kernel 4.1.6

From Note to self
Revision as of 17:51, 26 August 2015 by Hansvi (Talk | contribs) (Created page with "Man, the NVidia module build causes a lot of warnings! yuck! Had to put this on a seperate page. Output of the DKMS modules that didn't compile: <nowiki> DKMS make.log for...")

(diff) ← Older revision | Latest revision (diff) | Newer revision → (diff)
Jump to: navigation, search

Man, the NVidia module build causes a lot of warnings! yuck! Had to put this on a seperate page.

Output of the DKMS modules that didn't compile:

DKMS make.log for virtualbox-guest-4.3.18 for kernel 4.1.6-040106-generic (x86_64)
Wed Aug 26 18:23:48 CEST 2015
make: Entering directory `/usr/src/linux-headers-4.1.6-040106-generic'
  LD      /var/lib/dkms/virtualbox-guest/4.3.18/build/built-in.o
  LD      /var/lib/dkms/virtualbox-guest/4.3.18/build/vboxguest/built-in.o
  CC [M]  /var/lib/dkms/virtualbox-guest/4.3.18/build/vboxguest/VBoxGuest-linux.o
  CC [M]  /var/lib/dkms/virtualbox-guest/4.3.18/build/vboxguest/VBoxGuest.o
  CC [M]  /var/lib/dkms/virtualbox-guest/4.3.18/build/vboxguest/VBoxGuest2.o
  CC [M]  /var/lib/dkms/virtualbox-guest/4.3.18/build/vboxguest/GenericRequest.o
  CC [M]  /var/lib/dkms/virtualbox-guest/4.3.18/build/vboxguest/HGCMInternal.o
  CC [M]  /var/lib/dkms/virtualbox-guest/4.3.18/build/vboxguest/Init.o
  CC [M]  /var/lib/dkms/virtualbox-guest/4.3.18/build/vboxguest/PhysHeap.o
  CC [M]  /var/lib/dkms/virtualbox-guest/4.3.18/build/vboxguest/SysHlp.o
  CC [M]  /var/lib/dkms/virtualbox-guest/4.3.18/build/vboxguest/VMMDev.o
  CC [M]  /var/lib/dkms/virtualbox-guest/4.3.18/build/vboxguest/r0drv/alloc-r0drv.o
  CC [M]  /var/lib/dkms/virtualbox-guest/4.3.18/build/vboxguest/r0drv/initterm-r0drv.o
  CC [M]  /var/lib/dkms/virtualbox-guest/4.3.18/build/vboxguest/r0drv/memobj-r0drv.o
  CC [M]  /var/lib/dkms/virtualbox-guest/4.3.18/build/vboxguest/r0drv/mpnotification-r0drv.o
  CC [M]  /var/lib/dkms/virtualbox-guest/4.3.18/build/vboxguest/r0drv/powernotification-r0drv.o
  CC [M]  /var/lib/dkms/virtualbox-guest/4.3.18/build/vboxguest/r0drv/linux/alloc-r0drv-linux.o
  CC [M]  /var/lib/dkms/virtualbox-guest/4.3.18/build/vboxguest/r0drv/linux/assert-r0drv-linux.o
  CC [M]  /var/lib/dkms/virtualbox-guest/4.3.18/build/vboxguest/r0drv/linux/initterm-r0drv-linux.o
  CC [M]  /var/lib/dkms/virtualbox-guest/4.3.18/build/vboxguest/r0drv/linux/memobj-r0drv-linux.o
  CC [M]  /var/lib/dkms/virtualbox-guest/4.3.18/build/vboxguest/r0drv/linux/memuserkernel-r0drv-linux.o
  CC [M]  /var/lib/dkms/virtualbox-guest/4.3.18/build/vboxguest/r0drv/linux/mp-r0drv-linux.o
  CC [M]  /var/lib/dkms/virtualbox-guest/4.3.18/build/vboxguest/r0drv/linux/mpnotification-r0drv-linux.o
  CC [M]  /var/lib/dkms/virtualbox-guest/4.3.18/build/vboxguest/r0drv/linux/process-r0drv-linux.o
  CC [M]  /var/lib/dkms/virtualbox-guest/4.3.18/build/vboxguest/r0drv/linux/semevent-r0drv-linux.o
  CC [M]  /var/lib/dkms/virtualbox-guest/4.3.18/build/vboxguest/r0drv/linux/semeventmulti-r0drv-linux.o
  CC [M]  /var/lib/dkms/virtualbox-guest/4.3.18/build/vboxguest/r0drv/linux/semfastmutex-r0drv-linux.o
  CC [M]  /var/lib/dkms/virtualbox-guest/4.3.18/build/vboxguest/r0drv/linux/semmutex-r0drv-linux.o
  CC [M]  /var/lib/dkms/virtualbox-guest/4.3.18/build/vboxguest/r0drv/linux/spinlock-r0drv-linux.o
  CC [M]  /var/lib/dkms/virtualbox-guest/4.3.18/build/vboxguest/r0drv/linux/thread-r0drv-linux.o
  CC [M]  /var/lib/dkms/virtualbox-guest/4.3.18/build/vboxguest/r0drv/linux/thread2-r0drv-linux.o
  CC [M]  /var/lib/dkms/virtualbox-guest/4.3.18/build/vboxguest/r0drv/linux/time-r0drv-linux.o
  CC [M]  /var/lib/dkms/virtualbox-guest/4.3.18/build/vboxguest/r0drv/linux/RTLogWriteDebugger-r0drv-linux.o
  CC [M]  /var/lib/dkms/virtualbox-guest/4.3.18/build/vboxguest/r0drv/generic/semspinmutex-r0drv-generic.o
  CC [M]  /var/lib/dkms/virtualbox-guest/4.3.18/build/vboxguest/common/alloc/alloc.o
  CC [M]  /var/lib/dkms/virtualbox-guest/4.3.18/build/vboxguest/common/err/RTErrConvertFromErrno.o
  CC [M]  /var/lib/dkms/virtualbox-guest/4.3.18/build/vboxguest/common/err/RTErrConvertToErrno.o
  CC [M]  /var/lib/dkms/virtualbox-guest/4.3.18/build/vboxguest/common/log/log.o
  CC [M]  /var/lib/dkms/virtualbox-guest/4.3.18/build/vboxguest/common/log/logellipsis.o
  CC [M]  /var/lib/dkms/virtualbox-guest/4.3.18/build/vboxguest/common/log/logrel.o
  CC [M]  /var/lib/dkms/virtualbox-guest/4.3.18/build/vboxguest/common/log/logrelellipsis.o
  CC [M]  /var/lib/dkms/virtualbox-guest/4.3.18/build/vboxguest/common/log/logcom.o
  CC [M]  /var/lib/dkms/virtualbox-guest/4.3.18/build/vboxguest/common/log/logformat.o
  CC [M]  /var/lib/dkms/virtualbox-guest/4.3.18/build/vboxguest/common/misc/RTAssertMsg1Weak.o
  CC [M]  /var/lib/dkms/virtualbox-guest/4.3.18/build/vboxguest/common/misc/RTAssertMsg2.o
  CC [M]  /var/lib/dkms/virtualbox-guest/4.3.18/build/vboxguest/common/misc/RTAssertMsg2Add.o
  CC [M]  /var/lib/dkms/virtualbox-guest/4.3.18/build/vboxguest/common/misc/RTAssertMsg2AddWeak.o
  CC [M]  /var/lib/dkms/virtualbox-guest/4.3.18/build/vboxguest/common/misc/RTAssertMsg2AddWeakV.o
  CC [M]  /var/lib/dkms/virtualbox-guest/4.3.18/build/vboxguest/common/misc/RTAssertMsg2Weak.o
  CC [M]  /var/lib/dkms/virtualbox-guest/4.3.18/build/vboxguest/common/misc/RTAssertMsg2WeakV.o
  CC [M]  /var/lib/dkms/virtualbox-guest/4.3.18/build/vboxguest/common/misc/assert.o
  CC [M]  /var/lib/dkms/virtualbox-guest/4.3.18/build/vboxguest/common/misc/thread.o
  CC [M]  /var/lib/dkms/virtualbox-guest/4.3.18/build/vboxguest/common/string/RTStrCopy.o
  CC [M]  /var/lib/dkms/virtualbox-guest/4.3.18/build/vboxguest/common/string/RTStrCopyP.o
  CC [M]  /var/lib/dkms/virtualbox-guest/4.3.18/build/vboxguest/common/string/strformat.o
  CC [M]  /var/lib/dkms/virtualbox-guest/4.3.18/build/vboxguest/common/string/strformatrt.o
  CC [M]  /var/lib/dkms/virtualbox-guest/4.3.18/build/vboxguest/common/string/strformattype.o
  CC [M]  /var/lib/dkms/virtualbox-guest/4.3.18/build/vboxguest/common/string/strprintf.o
  CC [M]  /var/lib/dkms/virtualbox-guest/4.3.18/build/vboxguest/common/string/strtonum.o
  CC [M]  /var/lib/dkms/virtualbox-guest/4.3.18/build/vboxguest/common/table/avlpv.o
  CC [M]  /var/lib/dkms/virtualbox-guest/4.3.18/build/vboxguest/common/time/time.o
  CC [M]  /var/lib/dkms/virtualbox-guest/4.3.18/build/vboxguest/generic/RTAssertShouldPanic-generic.o
  CC [M]  /var/lib/dkms/virtualbox-guest/4.3.18/build/vboxguest/generic/RTLogWriteStdErr-stub-generic.o
  CC [M]  /var/lib/dkms/virtualbox-guest/4.3.18/build/vboxguest/generic/RTLogWriteStdOut-stub-generic.o
  CC [M]  /var/lib/dkms/virtualbox-guest/4.3.18/build/vboxguest/generic/RTSemEventWait-2-ex-generic.o
  CC [M]  /var/lib/dkms/virtualbox-guest/4.3.18/build/vboxguest/generic/RTSemEventWaitNoResume-2-ex-generic.o
  CC [M]  /var/lib/dkms/virtualbox-guest/4.3.18/build/vboxguest/generic/RTSemEventMultiWait-2-ex-generic.o
  CC [M]  /var/lib/dkms/virtualbox-guest/4.3.18/build/vboxguest/generic/RTSemEventMultiWaitNoResume-2-ex-generic.o
  CC [M]  /var/lib/dkms/virtualbox-guest/4.3.18/build/vboxguest/generic/errvars-generic.o
  CC [M]  /var/lib/dkms/virtualbox-guest/4.3.18/build/vboxguest/VBox/log-vbox.o
  CC [M]  /var/lib/dkms/virtualbox-guest/4.3.18/build/vboxguest/VBox/logbackdoor.o
  CC [M]  /var/lib/dkms/virtualbox-guest/4.3.18/build/vboxguest/common/alloc/heapsimple.o
  LD [M]  /var/lib/dkms/virtualbox-guest/4.3.18/build/vboxguest/vboxguest.o
  LD      /var/lib/dkms/virtualbox-guest/4.3.18/build/vboxsf/built-in.o
  CC [M]  /var/lib/dkms/virtualbox-guest/4.3.18/build/vboxsf/vfsmod.o
  CC [M]  /var/lib/dkms/virtualbox-guest/4.3.18/build/vboxsf/dirops.o
In file included from /var/lib/dkms/virtualbox-guest/4.3.18/build/vboxsf/dirops.c:19:0:
/var/lib/dkms/virtualbox-guest/4.3.18/build/vboxsf/dirops.c: In function ‘sf_getdent’:
/var/lib/dkms/virtualbox-guest/4.3.18/build/vboxsf/dirops.c:129:29: error: ‘struct file’ has no member named ‘f_dentry’
     sf_g = GET_GLOB_INFO(dir->f_dentry->d_inode->i_sb);
                             ^
/var/lib/dkms/virtualbox-guest/4.3.18/build/vboxsf/vfsmod.h:144:60: note: in definition of macro ‘GET_GLOB_INFO’
 # define GET_GLOB_INFO(sb)       ((struct sf_glob_info *) (sb)->s_fs_info)
                                                            ^
/var/lib/dkms/virtualbox-guest/4.3.18/build/vboxsf/dirops.c:135:16: error: ‘struct file’ has no member named ‘f_dentry’
     inode = dir->f_dentry->d_inode;
                ^
make[2]: *** [/var/lib/dkms/virtualbox-guest/4.3.18/build/vboxsf/dirops.o] Error 1
make[1]: *** [/var/lib/dkms/virtualbox-guest/4.3.18/build/vboxsf] Error 2
make: *** [_module_/var/lib/dkms/virtualbox-guest/4.3.18/build] Error 2
make: Leaving directory `/usr/src/linux-headers-4.1.6-040106-generic'

DKMS make.log for nvidia-340-340.76 for kernel 4.1.6-040106-generic (x86_64)
Wed Aug 26 18:23:48 CEST 2015
NVIDIA: calling KBUILD...
make[1]: Entering directory `/usr/src/linux-headers-4.1.6-040106-generic'
test -e include/generated/autoconf.h -a -e include/config/auto.conf || (		\
	echo >&2;							\
	echo >&2 "  ERROR: Kernel configuration is invalid.";		\
	echo >&2 "         include/generated/autoconf.h or include/config/auto.conf are missing.";\
	echo >&2 "         Run 'make oldconfig && make prepare' on kernel src to fix it.";	\
	echo >&2 ;							\
	/bin/false)
mkdir -p /var/lib/dkms/nvidia-340/340.76/build/.tmp_versions ; rm -f /var/lib/dkms/nvidia-340/340.76/build/.tmp_versions/*
make -f ./scripts/Makefile.build obj=/var/lib/dkms/nvidia-340/340.76/build
  cc -Wp,-MD,/var/lib/dkms/nvidia-340/340.76/build/.nv.o.d  -nostdinc -isystem /usr/lib/gcc/x86_64-linux-gnu/4.8/include -I./arch/x86/include -Iarch/x86/include/generated/uapi -Iarch/x86/include/generated  -Iinclude -I./arch/x86/include/uapi -Iarch/x86/include/generated/uapi -I./include/uapi -Iinclude/generated/uapi -include ./include/linux/kconfig.h -D__KERNEL__ -Wall -Wundef -Wstrict-prototypes -Wno-trigraphs -fno-strict-aliasing -fno-common -Werror-implicit-function-declaration -Wno-format-security -std=gnu89 -m64 -mno-80387 -mno-fp-ret-in-387 -mtune=generic -mno-red-zone -mcmodel=kernel -funit-at-a-time -maccumulate-outgoing-args -DCONFIG_X86_X32_ABI -DCONFIG_AS_CFI=1 -DCONFIG_AS_CFI_SIGNAL_FRAME=1 -DCONFIG_AS_CFI_SECTIONS=1 -DCONFIG_AS_FXSAVEQ=1 -DCONFIG_AS_SSSE3=1 -DCONFIG_AS_CRC32=1 -DCONFIG_AS_AVX=1 -DCONFIG_AS_AVX2=1 -pipe -Wno-sign-compare -fno-asynchronous-unwind-tables -mno-sse -mno-mmx -mno-sse2 -mno-3dnow -mno-avx -fno-delete-null-pointer-checks -O2 --param=allow-store-data-races=0 -Wframe-larger-than=1024 -fstack-protector -Wno-unused-but-set-variable -fno-omit-frame-pointer -fno-optimize-sibling-calls -fno-var-tracking-assignments -pg -mfentry -DCC_USING_FENTRY -Wdeclaration-after-statement -Wno-pointer-sign -fno-strict-overflow -fconserve-stack -Werror=implicit-int -Werror=strict-prototypes -DCC_HAVE_ASM_GOTO -DNV_MODULE_INSTANCE=0 -DNV_BUILD_MODULE_INSTANCES=0 -UDEBUG -U_DEBUG -DNDEBUG -I/var/lib/dkms/nvidia-340/340.76/build -Wall -MD -Wsign-compare -Wno-cast-qual -Wno-error -D__KERNEL__ -DMODULE -DNVRM -DNV_VERSION_STRING=\"340.76\" -Wno-unused-function -Wuninitialized -fno-strict-aliasing -mno-red-zone -mcmodel=kernel -DNV_UVM_ENABLE -D__linux__ -DNV_DEV_NAME=\"nvidia\"  -DMODULE  -D"KBUILD_STR(s)=#s" -D"KBUILD_BASENAME=KBUILD_STR(nv)"  -D"KBUILD_MODNAME=KBUILD_STR(nvidia)" -c -o /var/lib/dkms/nvidia-340/340.76/build/.tmp_nv.o /var/lib/dkms/nvidia-340/340.76/build/nv.c
In file included from include/uapi/linux/stddef.h:1:0,
                 from include/linux/stddef.h:4,
                 from ./include/uapi/linux/posix_types.h:4,
                 from include/uapi/linux/types.h:13,
                 from include/linux/types.h:5,
                 from include/uapi/linux/capability.h:16,
                 from include/linux/capability.h:15,
                 from include/linux/sched.h:15,
                 from include/linux/utsname.h:5,
                 from /var/lib/dkms/nvidia-340/340.76/build/nv-linux.h:44,
                 from /var/lib/dkms/nvidia-340/340.76/build/nv.c:13:
include/asm-generic/qrwlock.h: In function ‘queue_write_trylock’:
include/asm-generic/qrwlock.h:93:35: warning: comparison between signed and unsigned integer expressions [-Wsign-compare]
          cnts, cnts | _QW_LOCKED) == cnts);
                                   ^
include/linux/compiler.h:163:40: note: in definition of macro ‘likely’
 # define likely(x) __builtin_expect(!!(x), 1)
                                        ^
In file included from include/uapi/linux/stddef.h:1:0,
                 from include/linux/stddef.h:4,
                 from ./include/uapi/linux/posix_types.h:4,
                 from include/uapi/linux/types.h:13,
                 from include/linux/types.h:5,
                 from include/uapi/linux/capability.h:16,
                 from include/linux/capability.h:15,
                 from include/linux/sched.h:15,
                 from include/linux/utsname.h:5,
                 from /var/lib/dkms/nvidia-340/340.76/build/nv-linux.h:44,
                 from /var/lib/dkms/nvidia-340/340.76/build/nv.c:13:
./arch/x86/include/asm/uaccess.h: In function ‘copy_from_user’:
./arch/x86/include/asm/uaccess.h:712:26: warning: comparison between signed and unsigned integer expressions [-Wsign-compare]
  if (likely(sz < 0 || sz >= n))
                          ^
include/linux/compiler.h:163:40: note: in definition of macro ‘likely’
 # define likely(x) __builtin_expect(!!(x), 1)
                                        ^
./arch/x86/include/asm/uaccess.h: In function ‘copy_to_user’:
./arch/x86/include/asm/uaccess.h:730:26: warning: comparison between signed and unsigned integer expressions [-Wsign-compare]
  if (likely(sz < 0 || sz >= n))
                          ^
include/linux/compiler.h:163:40: note: in definition of macro ‘likely’
 # define likely(x) __builtin_expect(!!(x), 1)
                                        ^
  if [ "-pg" = "-pg" ]; then if [ /var/lib/dkms/nvidia-340/340.76/build/nv.o != "scripts/mod/empty.o" ]; then ./scripts/recordmcount  "/var/lib/dkms/nvidia-340/340.76/build/nv.o"; fi; fi;
  cc -Wp,-MD,/var/lib/dkms/nvidia-340/340.76/build/.nv-acpi.o.d  -nostdinc -isystem /usr/lib/gcc/x86_64-linux-gnu/4.8/include -I./arch/x86/include -Iarch/x86/include/generated/uapi -Iarch/x86/include/generated  -Iinclude -I./arch/x86/include/uapi -Iarch/x86/include/generated/uapi -I./include/uapi -Iinclude/generated/uapi -include ./include/linux/kconfig.h -D__KERNEL__ -Wall -Wundef -Wstrict-prototypes -Wno-trigraphs -fno-strict-aliasing -fno-common -Werror-implicit-function-declaration -Wno-format-security -std=gnu89 -m64 -mno-80387 -mno-fp-ret-in-387 -mtune=generic -mno-red-zone -mcmodel=kernel -funit-at-a-time -maccumulate-outgoing-args -DCONFIG_X86_X32_ABI -DCONFIG_AS_CFI=1 -DCONFIG_AS_CFI_SIGNAL_FRAME=1 -DCONFIG_AS_CFI_SECTIONS=1 -DCONFIG_AS_FXSAVEQ=1 -DCONFIG_AS_SSSE3=1 -DCONFIG_AS_CRC32=1 -DCONFIG_AS_AVX=1 -DCONFIG_AS_AVX2=1 -pipe -Wno-sign-compare -fno-asynchronous-unwind-tables -mno-sse -mno-mmx -mno-sse2 -mno-3dnow -mno-avx -fno-delete-null-pointer-checks -O2 --param=allow-store-data-races=0 -Wframe-larger-than=1024 -fstack-protector -Wno-unused-but-set-variable -fno-omit-frame-pointer -fno-optimize-sibling-calls -fno-var-tracking-assignments -pg -mfentry -DCC_USING_FENTRY -Wdeclaration-after-statement -Wno-pointer-sign -fno-strict-overflow -fconserve-stack -Werror=implicit-int -Werror=strict-prototypes -DCC_HAVE_ASM_GOTO -DNV_MODULE_INSTANCE=0 -DNV_BUILD_MODULE_INSTANCES=0 -UDEBUG -U_DEBUG -DNDEBUG -I/var/lib/dkms/nvidia-340/340.76/build -Wall -MD -Wsign-compare -Wno-cast-qual -Wno-error -D__KERNEL__ -DMODULE -DNVRM -DNV_VERSION_STRING=\"340.76\" -Wno-unused-function -Wuninitialized -fno-strict-aliasing -mno-red-zone -mcmodel=kernel -DNV_UVM_ENABLE -D__linux__ -DNV_DEV_NAME=\"nvidia\"  -DMODULE  -D"KBUILD_STR(s)=#s" -D"KBUILD_BASENAME=KBUILD_STR(nv_acpi)"  -D"KBUILD_MODNAME=KBUILD_STR(nvidia)" -c -o /var/lib/dkms/nvidia-340/340.76/build/.tmp_nv-acpi.o /var/lib/dkms/nvidia-340/340.76/build/nv-acpi.c
In file included from include/uapi/linux/stddef.h:1:0,
                 from include/linux/stddef.h:4,
                 from ./include/uapi/linux/posix_types.h:4,
                 from include/uapi/linux/types.h:13,
                 from include/linux/types.h:5,
                 from include/uapi/linux/capability.h:16,
                 from include/linux/capability.h:15,
                 from include/linux/sched.h:15,
                 from include/linux/utsname.h:5,
                 from /var/lib/dkms/nvidia-340/340.76/build/nv-linux.h:44,
                 from /var/lib/dkms/nvidia-340/340.76/build/nv-acpi.c:15:
include/asm-generic/qrwlock.h: In function ‘queue_write_trylock’:
include/asm-generic/qrwlock.h:93:35: warning: comparison between signed and unsigned integer expressions [-Wsign-compare]
          cnts, cnts | _QW_LOCKED) == cnts);
                                   ^
include/linux/compiler.h:163:40: note: in definition of macro ‘likely’
 # define likely(x) __builtin_expect(!!(x), 1)
                                        ^
In file included from include/uapi/linux/stddef.h:1:0,
                 from include/linux/stddef.h:4,
                 from ./include/uapi/linux/posix_types.h:4,
                 from include/uapi/linux/types.h:13,
                 from include/linux/types.h:5,
                 from include/uapi/linux/capability.h:16,
                 from include/linux/capability.h:15,
                 from include/linux/sched.h:15,
                 from include/linux/utsname.h:5,
                 from /var/lib/dkms/nvidia-340/340.76/build/nv-linux.h:44,
                 from /var/lib/dkms/nvidia-340/340.76/build/nv-acpi.c:15:
./arch/x86/include/asm/uaccess.h: In function ‘copy_from_user’:
./arch/x86/include/asm/uaccess.h:712:26: warning: comparison between signed and unsigned integer expressions [-Wsign-compare]
  if (likely(sz < 0 || sz >= n))
                          ^
include/linux/compiler.h:163:40: note: in definition of macro ‘likely’
 # define likely(x) __builtin_expect(!!(x), 1)
                                        ^
./arch/x86/include/asm/uaccess.h: In function ‘copy_to_user’:
./arch/x86/include/asm/uaccess.h:730:26: warning: comparison between signed and unsigned integer expressions [-Wsign-compare]
  if (likely(sz < 0 || sz >= n))
                          ^
include/linux/compiler.h:163:40: note: in definition of macro ‘likely’
 # define likely(x) __builtin_expect(!!(x), 1)
                                        ^
  if [ "-pg" = "-pg" ]; then if [ /var/lib/dkms/nvidia-340/340.76/build/nv-acpi.o != "scripts/mod/empty.o" ]; then ./scripts/recordmcount  "/var/lib/dkms/nvidia-340/340.76/build/nv-acpi.o"; fi; fi;
  cc -Wp,-MD,/var/lib/dkms/nvidia-340/340.76/build/.nv-chrdev.o.d  -nostdinc -isystem /usr/lib/gcc/x86_64-linux-gnu/4.8/include -I./arch/x86/include -Iarch/x86/include/generated/uapi -Iarch/x86/include/generated  -Iinclude -I./arch/x86/include/uapi -Iarch/x86/include/generated/uapi -I./include/uapi -Iinclude/generated/uapi -include ./include/linux/kconfig.h -D__KERNEL__ -Wall -Wundef -Wstrict-prototypes -Wno-trigraphs -fno-strict-aliasing -fno-common -Werror-implicit-function-declaration -Wno-format-security -std=gnu89 -m64 -mno-80387 -mno-fp-ret-in-387 -mtune=generic -mno-red-zone -mcmodel=kernel -funit-at-a-time -maccumulate-outgoing-args -DCONFIG_X86_X32_ABI -DCONFIG_AS_CFI=1 -DCONFIG_AS_CFI_SIGNAL_FRAME=1 -DCONFIG_AS_CFI_SECTIONS=1 -DCONFIG_AS_FXSAVEQ=1 -DCONFIG_AS_SSSE3=1 -DCONFIG_AS_CRC32=1 -DCONFIG_AS_AVX=1 -DCONFIG_AS_AVX2=1 -pipe -Wno-sign-compare -fno-asynchronous-unwind-tables -mno-sse -mno-mmx -mno-sse2 -mno-3dnow -mno-avx -fno-delete-null-pointer-checks -O2 --param=allow-store-data-races=0 -Wframe-larger-than=1024 -fstack-protector -Wno-unused-but-set-variable -fno-omit-frame-pointer -fno-optimize-sibling-calls -fno-var-tracking-assignments -pg -mfentry -DCC_USING_FENTRY -Wdeclaration-after-statement -Wno-pointer-sign -fno-strict-overflow -fconserve-stack -Werror=implicit-int -Werror=strict-prototypes -DCC_HAVE_ASM_GOTO -DNV_MODULE_INSTANCE=0 -DNV_BUILD_MODULE_INSTANCES=0 -UDEBUG -U_DEBUG -DNDEBUG -I/var/lib/dkms/nvidia-340/340.76/build -Wall -MD -Wsign-compare -Wno-cast-qual -Wno-error -D__KERNEL__ -DMODULE -DNVRM -DNV_VERSION_STRING=\"340.76\" -Wno-unused-function -Wuninitialized -fno-strict-aliasing -mno-red-zone -mcmodel=kernel -DNV_UVM_ENABLE -D__linux__ -DNV_DEV_NAME=\"nvidia\"  -DMODULE  -D"KBUILD_STR(s)=#s" -D"KBUILD_BASENAME=KBUILD_STR(nv_chrdev)"  -D"KBUILD_MODNAME=KBUILD_STR(nvidia)" -c -o /var/lib/dkms/nvidia-340/340.76/build/.tmp_nv-chrdev.o /var/lib/dkms/nvidia-340/340.76/build/nv-chrdev.c
In file included from include/uapi/linux/stddef.h:1:0,
                 from include/linux/stddef.h:4,
                 from ./include/uapi/linux/posix_types.h:4,
                 from include/uapi/linux/types.h:13,
                 from include/linux/types.h:5,
                 from include/uapi/linux/capability.h:16,
                 from include/linux/capability.h:15,
                 from include/linux/sched.h:15,
                 from include/linux/utsname.h:5,
                 from /var/lib/dkms/nvidia-340/340.76/build/nv-linux.h:44,
                 from /var/lib/dkms/nvidia-340/340.76/build/nv-chrdev.c:15:
include/asm-generic/qrwlock.h: In function ‘queue_write_trylock’:
include/asm-generic/qrwlock.h:93:35: warning: comparison between signed and unsigned integer expressions [-Wsign-compare]
          cnts, cnts | _QW_LOCKED) == cnts);
                                   ^
include/linux/compiler.h:163:40: note: in definition of macro ‘likely’
 # define likely(x) __builtin_expect(!!(x), 1)
                                        ^
In file included from include/uapi/linux/stddef.h:1:0,
                 from include/linux/stddef.h:4,
                 from ./include/uapi/linux/posix_types.h:4,
                 from include/uapi/linux/types.h:13,
                 from include/linux/types.h:5,
                 from include/uapi/linux/capability.h:16,
                 from include/linux/capability.h:15,
                 from include/linux/sched.h:15,
                 from include/linux/utsname.h:5,
                 from /var/lib/dkms/nvidia-340/340.76/build/nv-linux.h:44,
                 from /var/lib/dkms/nvidia-340/340.76/build/nv-chrdev.c:15:
./arch/x86/include/asm/uaccess.h: In function ‘copy_from_user’:
./arch/x86/include/asm/uaccess.h:712:26: warning: comparison between signed and unsigned integer expressions [-Wsign-compare]
  if (likely(sz < 0 || sz >= n))
                          ^
include/linux/compiler.h:163:40: note: in definition of macro ‘likely’
 # define likely(x) __builtin_expect(!!(x), 1)
                                        ^
./arch/x86/include/asm/uaccess.h: In function ‘copy_to_user’:
./arch/x86/include/asm/uaccess.h:730:26: warning: comparison between signed and unsigned integer expressions [-Wsign-compare]
  if (likely(sz < 0 || sz >= n))
                          ^
include/linux/compiler.h:163:40: note: in definition of macro ‘likely’
 # define likely(x) __builtin_expect(!!(x), 1)
                                        ^
  if [ "-pg" = "-pg" ]; then if [ /var/lib/dkms/nvidia-340/340.76/build/nv-chrdev.o != "scripts/mod/empty.o" ]; then ./scripts/recordmcount  "/var/lib/dkms/nvidia-340/340.76/build/nv-chrdev.o"; fi; fi;
  cc -Wp,-MD,/var/lib/dkms/nvidia-340/340.76/build/.nv-cray.o.d  -nostdinc -isystem /usr/lib/gcc/x86_64-linux-gnu/4.8/include -I./arch/x86/include -Iarch/x86/include/generated/uapi -Iarch/x86/include/generated  -Iinclude -I./arch/x86/include/uapi -Iarch/x86/include/generated/uapi -I./include/uapi -Iinclude/generated/uapi -include ./include/linux/kconfig.h -D__KERNEL__ -Wall -Wundef -Wstrict-prototypes -Wno-trigraphs -fno-strict-aliasing -fno-common -Werror-implicit-function-declaration -Wno-format-security -std=gnu89 -m64 -mno-80387 -mno-fp-ret-in-387 -mtune=generic -mno-red-zone -mcmodel=kernel -funit-at-a-time -maccumulate-outgoing-args -DCONFIG_X86_X32_ABI -DCONFIG_AS_CFI=1 -DCONFIG_AS_CFI_SIGNAL_FRAME=1 -DCONFIG_AS_CFI_SECTIONS=1 -DCONFIG_AS_FXSAVEQ=1 -DCONFIG_AS_SSSE3=1 -DCONFIG_AS_CRC32=1 -DCONFIG_AS_AVX=1 -DCONFIG_AS_AVX2=1 -pipe -Wno-sign-compare -fno-asynchronous-unwind-tables -mno-sse -mno-mmx -mno-sse2 -mno-3dnow -mno-avx -fno-delete-null-pointer-checks -O2 --param=allow-store-data-races=0 -Wframe-larger-than=1024 -fstack-protector -Wno-unused-but-set-variable -fno-omit-frame-pointer -fno-optimize-sibling-calls -fno-var-tracking-assignments -pg -mfentry -DCC_USING_FENTRY -Wdeclaration-after-statement -Wno-pointer-sign -fno-strict-overflow -fconserve-stack -Werror=implicit-int -Werror=strict-prototypes -DCC_HAVE_ASM_GOTO -DNV_MODULE_INSTANCE=0 -DNV_BUILD_MODULE_INSTANCES=0 -UDEBUG -U_DEBUG -DNDEBUG -I/var/lib/dkms/nvidia-340/340.76/build -Wall -MD -Wsign-compare -Wno-cast-qual -Wno-error -D__KERNEL__ -DMODULE -DNVRM -DNV_VERSION_STRING=\"340.76\" -Wno-unused-function -Wuninitialized -fno-strict-aliasing -mno-red-zone -mcmodel=kernel -DNV_UVM_ENABLE -D__linux__ -DNV_DEV_NAME=\"nvidia\"  -DMODULE  -D"KBUILD_STR(s)=#s" -D"KBUILD_BASENAME=KBUILD_STR(nv_cray)"  -D"KBUILD_MODNAME=KBUILD_STR(nvidia)" -c -o /var/lib/dkms/nvidia-340/340.76/build/.tmp_nv-cray.o /var/lib/dkms/nvidia-340/340.76/build/nv-cray.c
In file included from include/uapi/linux/stddef.h:1:0,
                 from include/linux/stddef.h:4,
                 from ./include/uapi/linux/posix_types.h:4,
                 from include/uapi/linux/types.h:13,
                 from include/linux/types.h:5,
                 from include/uapi/linux/capability.h:16,
                 from include/linux/capability.h:15,
                 from include/linux/sched.h:15,
                 from include/linux/utsname.h:5,
                 from /var/lib/dkms/nvidia-340/340.76/build/nv-linux.h:44,
                 from /var/lib/dkms/nvidia-340/340.76/build/nv-cray.c:15:
include/asm-generic/qrwlock.h: In function ‘queue_write_trylock’:
include/asm-generic/qrwlock.h:93:35: warning: comparison between signed and unsigned integer expressions [-Wsign-compare]
          cnts, cnts | _QW_LOCKED) == cnts);
                                   ^
include/linux/compiler.h:163:40: note: in definition of macro ‘likely’
 # define likely(x) __builtin_expect(!!(x), 1)
                                        ^
In file included from include/uapi/linux/stddef.h:1:0,
                 from include/linux/stddef.h:4,
                 from ./include/uapi/linux/posix_types.h:4,
                 from include/uapi/linux/types.h:13,
                 from include/linux/types.h:5,
                 from include/uapi/linux/capability.h:16,
                 from include/linux/capability.h:15,
                 from include/linux/sched.h:15,
                 from include/linux/utsname.h:5,
                 from /var/lib/dkms/nvidia-340/340.76/build/nv-linux.h:44,
                 from /var/lib/dkms/nvidia-340/340.76/build/nv-cray.c:15:
./arch/x86/include/asm/uaccess.h: In function ‘copy_from_user’:
./arch/x86/include/asm/uaccess.h:712:26: warning: comparison between signed and unsigned integer expressions [-Wsign-compare]
  if (likely(sz < 0 || sz >= n))
                          ^
include/linux/compiler.h:163:40: note: in definition of macro ‘likely’
 # define likely(x) __builtin_expect(!!(x), 1)
                                        ^
./arch/x86/include/asm/uaccess.h: In function ‘copy_to_user’:
./arch/x86/include/asm/uaccess.h:730:26: warning: comparison between signed and unsigned integer expressions [-Wsign-compare]
  if (likely(sz < 0 || sz >= n))
                          ^
include/linux/compiler.h:163:40: note: in definition of macro ‘likely’
 # define likely(x) __builtin_expect(!!(x), 1)
                                        ^
  if [ "-pg" = "-pg" ]; then if [ /var/lib/dkms/nvidia-340/340.76/build/nv-cray.o != "scripts/mod/empty.o" ]; then ./scripts/recordmcount  "/var/lib/dkms/nvidia-340/340.76/build/nv-cray.o"; fi; fi;
  cc -Wp,-MD,/var/lib/dkms/nvidia-340/340.76/build/.nv-dma.o.d  -nostdinc -isystem /usr/lib/gcc/x86_64-linux-gnu/4.8/include -I./arch/x86/include -Iarch/x86/include/generated/uapi -Iarch/x86/include/generated  -Iinclude -I./arch/x86/include/uapi -Iarch/x86/include/generated/uapi -I./include/uapi -Iinclude/generated/uapi -include ./include/linux/kconfig.h -D__KERNEL__ -Wall -Wundef -Wstrict-prototypes -Wno-trigraphs -fno-strict-aliasing -fno-common -Werror-implicit-function-declaration -Wno-format-security -std=gnu89 -m64 -mno-80387 -mno-fp-ret-in-387 -mtune=generic -mno-red-zone -mcmodel=kernel -funit-at-a-time -maccumulate-outgoing-args -DCONFIG_X86_X32_ABI -DCONFIG_AS_CFI=1 -DCONFIG_AS_CFI_SIGNAL_FRAME=1 -DCONFIG_AS_CFI_SECTIONS=1 -DCONFIG_AS_FXSAVEQ=1 -DCONFIG_AS_SSSE3=1 -DCONFIG_AS_CRC32=1 -DCONFIG_AS_AVX=1 -DCONFIG_AS_AVX2=1 -pipe -Wno-sign-compare -fno-asynchronous-unwind-tables -mno-sse -mno-mmx -mno-sse2 -mno-3dnow -mno-avx -fno-delete-null-pointer-checks -O2 --param=allow-store-data-races=0 -Wframe-larger-than=1024 -fstack-protector -Wno-unused-but-set-variable -fno-omit-frame-pointer -fno-optimize-sibling-calls -fno-var-tracking-assignments -pg -mfentry -DCC_USING_FENTRY -Wdeclaration-after-statement -Wno-pointer-sign -fno-strict-overflow -fconserve-stack -Werror=implicit-int -Werror=strict-prototypes -DCC_HAVE_ASM_GOTO -DNV_MODULE_INSTANCE=0 -DNV_BUILD_MODULE_INSTANCES=0 -UDEBUG -U_DEBUG -DNDEBUG -I/var/lib/dkms/nvidia-340/340.76/build -Wall -MD -Wsign-compare -Wno-cast-qual -Wno-error -D__KERNEL__ -DMODULE -DNVRM -DNV_VERSION_STRING=\"340.76\" -Wno-unused-function -Wuninitialized -fno-strict-aliasing -mno-red-zone -mcmodel=kernel -DNV_UVM_ENABLE -D__linux__ -DNV_DEV_NAME=\"nvidia\"  -DMODULE  -D"KBUILD_STR(s)=#s" -D"KBUILD_BASENAME=KBUILD_STR(nv_dma)"  -D"KBUILD_MODNAME=KBUILD_STR(nvidia)" -c -o /var/lib/dkms/nvidia-340/340.76/build/.tmp_nv-dma.o /var/lib/dkms/nvidia-340/340.76/build/nv-dma.c
In file included from include/uapi/linux/stddef.h:1:0,
                 from include/linux/stddef.h:4,
                 from ./include/uapi/linux/posix_types.h:4,
                 from include/uapi/linux/types.h:13,
                 from include/linux/types.h:5,
                 from include/uapi/linux/capability.h:16,
                 from include/linux/capability.h:15,
                 from include/linux/sched.h:15,
                 from include/linux/utsname.h:5,
                 from /var/lib/dkms/nvidia-340/340.76/build/nv-linux.h:44,
                 from /var/lib/dkms/nvidia-340/340.76/build/nv-dma.c:15:
include/asm-generic/qrwlock.h: In function ‘queue_write_trylock’:
include/asm-generic/qrwlock.h:93:35: warning: comparison between signed and unsigned integer expressions [-Wsign-compare]
          cnts, cnts | _QW_LOCKED) == cnts);
                                   ^
include/linux/compiler.h:163:40: note: in definition of macro ‘likely’
 # define likely(x) __builtin_expect(!!(x), 1)
                                        ^
In file included from include/uapi/linux/stddef.h:1:0,
                 from include/linux/stddef.h:4,
                 from ./include/uapi/linux/posix_types.h:4,
                 from include/uapi/linux/types.h:13,
                 from include/linux/types.h:5,
                 from include/uapi/linux/capability.h:16,
                 from include/linux/capability.h:15,
                 from include/linux/sched.h:15,
                 from include/linux/utsname.h:5,
                 from /var/lib/dkms/nvidia-340/340.76/build/nv-linux.h:44,
                 from /var/lib/dkms/nvidia-340/340.76/build/nv-dma.c:15:
./arch/x86/include/asm/uaccess.h: In function ‘copy_from_user’:
./arch/x86/include/asm/uaccess.h:712:26: warning: comparison between signed and unsigned integer expressions [-Wsign-compare]
  if (likely(sz < 0 || sz >= n))
                          ^
include/linux/compiler.h:163:40: note: in definition of macro ‘likely’
 # define likely(x) __builtin_expect(!!(x), 1)
                                        ^
./arch/x86/include/asm/uaccess.h: In function ‘copy_to_user’:
./arch/x86/include/asm/uaccess.h:730:26: warning: comparison between signed and unsigned integer expressions [-Wsign-compare]
  if (likely(sz < 0 || sz >= n))
                          ^
include/linux/compiler.h:163:40: note: in definition of macro ‘likely’
 # define likely(x) __builtin_expect(!!(x), 1)
                                        ^
  if [ "-pg" = "-pg" ]; then if [ /var/lib/dkms/nvidia-340/340.76/build/nv-dma.o != "scripts/mod/empty.o" ]; then ./scripts/recordmcount  "/var/lib/dkms/nvidia-340/340.76/build/nv-dma.o"; fi; fi;
  cc -Wp,-MD,/var/lib/dkms/nvidia-340/340.76/build/.nv-drm.o.d  -nostdinc -isystem /usr/lib/gcc/x86_64-linux-gnu/4.8/include -I./arch/x86/include -Iarch/x86/include/generated/uapi -Iarch/x86/include/generated  -Iinclude -I./arch/x86/include/uapi -Iarch/x86/include/generated/uapi -I./include/uapi -Iinclude/generated/uapi -include ./include/linux/kconfig.h -D__KERNEL__ -Wall -Wundef -Wstrict-prototypes -Wno-trigraphs -fno-strict-aliasing -fno-common -Werror-implicit-function-declaration -Wno-format-security -std=gnu89 -m64 -mno-80387 -mno-fp-ret-in-387 -mtune=generic -mno-red-zone -mcmodel=kernel -funit-at-a-time -maccumulate-outgoing-args -DCONFIG_X86_X32_ABI -DCONFIG_AS_CFI=1 -DCONFIG_AS_CFI_SIGNAL_FRAME=1 -DCONFIG_AS_CFI_SECTIONS=1 -DCONFIG_AS_FXSAVEQ=1 -DCONFIG_AS_SSSE3=1 -DCONFIG_AS_CRC32=1 -DCONFIG_AS_AVX=1 -DCONFIG_AS_AVX2=1 -pipe -Wno-sign-compare -fno-asynchronous-unwind-tables -mno-sse -mno-mmx -mno-sse2 -mno-3dnow -mno-avx -fno-delete-null-pointer-checks -O2 --param=allow-store-data-races=0 -Wframe-larger-than=1024 -fstack-protector -Wno-unused-but-set-variable -fno-omit-frame-pointer -fno-optimize-sibling-calls -fno-var-tracking-assignments -pg -mfentry -DCC_USING_FENTRY -Wdeclaration-after-statement -Wno-pointer-sign -fno-strict-overflow -fconserve-stack -Werror=implicit-int -Werror=strict-prototypes -DCC_HAVE_ASM_GOTO -DNV_MODULE_INSTANCE=0 -DNV_BUILD_MODULE_INSTANCES=0 -UDEBUG -U_DEBUG -DNDEBUG -I/var/lib/dkms/nvidia-340/340.76/build -Wall -MD -Wsign-compare -Wno-cast-qual -Wno-error -D__KERNEL__ -DMODULE -DNVRM -DNV_VERSION_STRING=\"340.76\" -Wno-unused-function -Wuninitialized -fno-strict-aliasing -mno-red-zone -mcmodel=kernel -DNV_UVM_ENABLE -D__linux__ -DNV_DEV_NAME=\"nvidia\"  -DMODULE  -D"KBUILD_STR(s)=#s" -D"KBUILD_BASENAME=KBUILD_STR(nv_drm)"  -D"KBUILD_MODNAME=KBUILD_STR(nvidia)" -c -o /var/lib/dkms/nvidia-340/340.76/build/.tmp_nv-drm.o /var/lib/dkms/nvidia-340/340.76/build/nv-drm.c
In file included from include/uapi/linux/stddef.h:1:0,
                 from include/linux/stddef.h:4,
                 from ./include/uapi/linux/posix_types.h:4,
                 from include/uapi/linux/types.h:13,
                 from include/linux/types.h:5,
                 from include/uapi/linux/capability.h:16,
                 from include/linux/capability.h:15,
                 from include/linux/sched.h:15,
                 from include/linux/utsname.h:5,
                 from /var/lib/dkms/nvidia-340/340.76/build/nv-linux.h:44,
                 from /var/lib/dkms/nvidia-340/340.76/build/nv-drm.c:15:
include/asm-generic/qrwlock.h: In function ‘queue_write_trylock’:
include/asm-generic/qrwlock.h:93:35: warning: comparison between signed and unsigned integer expressions [-Wsign-compare]
          cnts, cnts | _QW_LOCKED) == cnts);
                                   ^
include/linux/compiler.h:163:40: note: in definition of macro ‘likely’
 # define likely(x) __builtin_expect(!!(x), 1)
                                        ^
In file included from include/uapi/linux/stddef.h:1:0,
                 from include/linux/stddef.h:4,
                 from ./include/uapi/linux/posix_types.h:4,
                 from include/uapi/linux/types.h:13,
                 from include/linux/types.h:5,
                 from include/uapi/linux/capability.h:16,
                 from include/linux/capability.h:15,
                 from include/linux/sched.h:15,
                 from include/linux/utsname.h:5,
                 from /var/lib/dkms/nvidia-340/340.76/build/nv-linux.h:44,
                 from /var/lib/dkms/nvidia-340/340.76/build/nv-drm.c:15:
./arch/x86/include/asm/uaccess.h: In function ‘copy_from_user’:
./arch/x86/include/asm/uaccess.h:712:26: warning: comparison between signed and unsigned integer expressions [-Wsign-compare]
  if (likely(sz < 0 || sz >= n))
                          ^
include/linux/compiler.h:163:40: note: in definition of macro ‘likely’
 # define likely(x) __builtin_expect(!!(x), 1)
                                        ^
./arch/x86/include/asm/uaccess.h: In function ‘copy_to_user’:
./arch/x86/include/asm/uaccess.h:730:26: warning: comparison between signed and unsigned integer expressions [-Wsign-compare]
  if (likely(sz < 0 || sz >= n))
                          ^
include/linux/compiler.h:163:40: note: in definition of macro ‘likely’
 # define likely(x) __builtin_expect(!!(x), 1)
                                        ^
  if [ "-pg" = "-pg" ]; then if [ /var/lib/dkms/nvidia-340/340.76/build/nv-drm.o != "scripts/mod/empty.o" ]; then ./scripts/recordmcount  "/var/lib/dkms/nvidia-340/340.76/build/nv-drm.o"; fi; fi;
  cc -Wp,-MD,/var/lib/dkms/nvidia-340/340.76/build/.nv-gvi.o.d  -nostdinc -isystem /usr/lib/gcc/x86_64-linux-gnu/4.8/include -I./arch/x86/include -Iarch/x86/include/generated/uapi -Iarch/x86/include/generated  -Iinclude -I./arch/x86/include/uapi -Iarch/x86/include/generated/uapi -I./include/uapi -Iinclude/generated/uapi -include ./include/linux/kconfig.h -D__KERNEL__ -Wall -Wundef -Wstrict-prototypes -Wno-trigraphs -fno-strict-aliasing -fno-common -Werror-implicit-function-declaration -Wno-format-security -std=gnu89 -m64 -mno-80387 -mno-fp-ret-in-387 -mtune=generic -mno-red-zone -mcmodel=kernel -funit-at-a-time -maccumulate-outgoing-args -DCONFIG_X86_X32_ABI -DCONFIG_AS_CFI=1 -DCONFIG_AS_CFI_SIGNAL_FRAME=1 -DCONFIG_AS_CFI_SECTIONS=1 -DCONFIG_AS_FXSAVEQ=1 -DCONFIG_AS_SSSE3=1 -DCONFIG_AS_CRC32=1 -DCONFIG_AS_AVX=1 -DCONFIG_AS_AVX2=1 -pipe -Wno-sign-compare -fno-asynchronous-unwind-tables -mno-sse -mno-mmx -mno-sse2 -mno-3dnow -mno-avx -fno-delete-null-pointer-checks -O2 --param=allow-store-data-races=0 -Wframe-larger-than=1024 -fstack-protector -Wno-unused-but-set-variable -fno-omit-frame-pointer -fno-optimize-sibling-calls -fno-var-tracking-assignments -pg -mfentry -DCC_USING_FENTRY -Wdeclaration-after-statement -Wno-pointer-sign -fno-strict-overflow -fconserve-stack -Werror=implicit-int -Werror=strict-prototypes -DCC_HAVE_ASM_GOTO -DNV_MODULE_INSTANCE=0 -DNV_BUILD_MODULE_INSTANCES=0 -UDEBUG -U_DEBUG -DNDEBUG -I/var/lib/dkms/nvidia-340/340.76/build -Wall -MD -Wsign-compare -Wno-cast-qual -Wno-error -D__KERNEL__ -DMODULE -DNVRM -DNV_VERSION_STRING=\"340.76\" -Wno-unused-function -Wuninitialized -fno-strict-aliasing -mno-red-zone -mcmodel=kernel -DNV_UVM_ENABLE -D__linux__ -DNV_DEV_NAME=\"nvidia\"  -DMODULE  -D"KBUILD_STR(s)=#s" -D"KBUILD_BASENAME=KBUILD_STR(nv_gvi)"  -D"KBUILD_MODNAME=KBUILD_STR(nvidia)" -c -o /var/lib/dkms/nvidia-340/340.76/build/.tmp_nv-gvi.o /var/lib/dkms/nvidia-340/340.76/build/nv-gvi.c
In file included from include/uapi/linux/stddef.h:1:0,
                 from include/linux/stddef.h:4,
                 from ./include/uapi/linux/posix_types.h:4,
                 from include/uapi/linux/types.h:13,
                 from include/linux/types.h:5,
                 from include/uapi/linux/capability.h:16,
                 from include/linux/capability.h:15,
                 from include/linux/sched.h:15,
                 from include/linux/utsname.h:5,
                 from /var/lib/dkms/nvidia-340/340.76/build/nv-linux.h:44,
                 from /var/lib/dkms/nvidia-340/340.76/build/nv-gvi.c:15:
include/asm-generic/qrwlock.h: In function ‘queue_write_trylock’:
include/asm-generic/qrwlock.h:93:35: warning: comparison between signed and unsigned integer expressions [-Wsign-compare]
          cnts, cnts | _QW_LOCKED) == cnts);
                                   ^
include/linux/compiler.h:163:40: note: in definition of macro ‘likely’
 # define likely(x) __builtin_expect(!!(x), 1)
                                        ^
In file included from include/uapi/linux/stddef.h:1:0,
                 from include/linux/stddef.h:4,
                 from ./include/uapi/linux/posix_types.h:4,
                 from include/uapi/linux/types.h:13,
                 from include/linux/types.h:5,
                 from include/uapi/linux/capability.h:16,
                 from include/linux/capability.h:15,
                 from include/linux/sched.h:15,
                 from include/linux/utsname.h:5,
                 from /var/lib/dkms/nvidia-340/340.76/build/nv-linux.h:44,
                 from /var/lib/dkms/nvidia-340/340.76/build/nv-gvi.c:15:
./arch/x86/include/asm/uaccess.h: In function ‘copy_from_user’:
./arch/x86/include/asm/uaccess.h:712:26: warning: comparison between signed and unsigned integer expressions [-Wsign-compare]
  if (likely(sz < 0 || sz >= n))
                          ^
include/linux/compiler.h:163:40: note: in definition of macro ‘likely’
 # define likely(x) __builtin_expect(!!(x), 1)
                                        ^
./arch/x86/include/asm/uaccess.h: In function ‘copy_to_user’:
./arch/x86/include/asm/uaccess.h:730:26: warning: comparison between signed and unsigned integer expressions [-Wsign-compare]
  if (likely(sz < 0 || sz >= n))
                          ^
include/linux/compiler.h:163:40: note: in definition of macro ‘likely’
 # define likely(x) __builtin_expect(!!(x), 1)
                                        ^
  if [ "-pg" = "-pg" ]; then if [ /var/lib/dkms/nvidia-340/340.76/build/nv-gvi.o != "scripts/mod/empty.o" ]; then ./scripts/recordmcount  "/var/lib/dkms/nvidia-340/340.76/build/nv-gvi.o"; fi; fi;
  cc -Wp,-MD,/var/lib/dkms/nvidia-340/340.76/build/.nv-i2c.o.d  -nostdinc -isystem /usr/lib/gcc/x86_64-linux-gnu/4.8/include -I./arch/x86/include -Iarch/x86/include/generated/uapi -Iarch/x86/include/generated  -Iinclude -I./arch/x86/include/uapi -Iarch/x86/include/generated/uapi -I./include/uapi -Iinclude/generated/uapi -include ./include/linux/kconfig.h -D__KERNEL__ -Wall -Wundef -Wstrict-prototypes -Wno-trigraphs -fno-strict-aliasing -fno-common -Werror-implicit-function-declaration -Wno-format-security -std=gnu89 -m64 -mno-80387 -mno-fp-ret-in-387 -mtune=generic -mno-red-zone -mcmodel=kernel -funit-at-a-time -maccumulate-outgoing-args -DCONFIG_X86_X32_ABI -DCONFIG_AS_CFI=1 -DCONFIG_AS_CFI_SIGNAL_FRAME=1 -DCONFIG_AS_CFI_SECTIONS=1 -DCONFIG_AS_FXSAVEQ=1 -DCONFIG_AS_SSSE3=1 -DCONFIG_AS_CRC32=1 -DCONFIG_AS_AVX=1 -DCONFIG_AS_AVX2=1 -pipe -Wno-sign-compare -fno-asynchronous-unwind-tables -mno-sse -mno-mmx -mno-sse2 -mno-3dnow -mno-avx -fno-delete-null-pointer-checks -O2 --param=allow-store-data-races=0 -Wframe-larger-than=1024 -fstack-protector -Wno-unused-but-set-variable -fno-omit-frame-pointer -fno-optimize-sibling-calls -fno-var-tracking-assignments -pg -mfentry -DCC_USING_FENTRY -Wdeclaration-after-statement -Wno-pointer-sign -fno-strict-overflow -fconserve-stack -Werror=implicit-int -Werror=strict-prototypes -DCC_HAVE_ASM_GOTO -DNV_MODULE_INSTANCE=0 -DNV_BUILD_MODULE_INSTANCES=0 -UDEBUG -U_DEBUG -DNDEBUG -I/var/lib/dkms/nvidia-340/340.76/build -Wall -MD -Wsign-compare -Wno-cast-qual -Wno-error -D__KERNEL__ -DMODULE -DNVRM -DNV_VERSION_STRING=\"340.76\" -Wno-unused-function -Wuninitialized -fno-strict-aliasing -mno-red-zone -mcmodel=kernel -DNV_UVM_ENABLE -D__linux__ -DNV_DEV_NAME=\"nvidia\"  -DMODULE  -D"KBUILD_STR(s)=#s" -D"KBUILD_BASENAME=KBUILD_STR(nv_i2c)"  -D"KBUILD_MODNAME=KBUILD_STR(nvidia)" -c -o /var/lib/dkms/nvidia-340/340.76/build/.tmp_nv-i2c.o /var/lib/dkms/nvidia-340/340.76/build/nv-i2c.c
In file included from include/uapi/linux/stddef.h:1:0,
                 from include/linux/stddef.h:4,
                 from ./include/uapi/linux/posix_types.h:4,
                 from include/uapi/linux/types.h:13,
                 from include/linux/types.h:5,
                 from include/uapi/linux/capability.h:16,
                 from include/linux/capability.h:15,
                 from include/linux/sched.h:15,
                 from include/linux/utsname.h:5,
                 from /var/lib/dkms/nvidia-340/340.76/build/nv-linux.h:44,
                 from /var/lib/dkms/nvidia-340/340.76/build/nv-i2c.c:15:
include/asm-generic/qrwlock.h: In function ‘queue_write_trylock’:
include/asm-generic/qrwlock.h:93:35: warning: comparison between signed and unsigned integer expressions [-Wsign-compare]
          cnts, cnts | _QW_LOCKED) == cnts);
                                   ^
include/linux/compiler.h:163:40: note: in definition of macro ‘likely’
 # define likely(x) __builtin_expect(!!(x), 1)
                                        ^
In file included from include/uapi/linux/stddef.h:1:0,
                 from include/linux/stddef.h:4,
                 from ./include/uapi/linux/posix_types.h:4,
                 from include/uapi/linux/types.h:13,
                 from include/linux/types.h:5,
                 from include/uapi/linux/capability.h:16,
                 from include/linux/capability.h:15,
                 from include/linux/sched.h:15,
                 from include/linux/utsname.h:5,
                 from /var/lib/dkms/nvidia-340/340.76/build/nv-linux.h:44,
                 from /var/lib/dkms/nvidia-340/340.76/build/nv-i2c.c:15:
./arch/x86/include/asm/uaccess.h: In function ‘copy_from_user’:
./arch/x86/include/asm/uaccess.h:712:26: warning: comparison between signed and unsigned integer expressions [-Wsign-compare]
  if (likely(sz < 0 || sz >= n))
                          ^
include/linux/compiler.h:163:40: note: in definition of macro ‘likely’
 # define likely(x) __builtin_expect(!!(x), 1)
                                        ^
./arch/x86/include/asm/uaccess.h: In function ‘copy_to_user’:
./arch/x86/include/asm/uaccess.h:730:26: warning: comparison between signed and unsigned integer expressions [-Wsign-compare]
  if (likely(sz < 0 || sz >= n))
                          ^
include/linux/compiler.h:163:40: note: in definition of macro ‘likely’
 # define likely(x) __builtin_expect(!!(x), 1)
                                        ^
  if [ "-pg" = "-pg" ]; then if [ /var/lib/dkms/nvidia-340/340.76/build/nv-i2c.o != "scripts/mod/empty.o" ]; then ./scripts/recordmcount  "/var/lib/dkms/nvidia-340/340.76/build/nv-i2c.o"; fi; fi;
  cc -Wp,-MD,/var/lib/dkms/nvidia-340/340.76/build/.nv-mempool.o.d  -nostdinc -isystem /usr/lib/gcc/x86_64-linux-gnu/4.8/include -I./arch/x86/include -Iarch/x86/include/generated/uapi -Iarch/x86/include/generated  -Iinclude -I./arch/x86/include/uapi -Iarch/x86/include/generated/uapi -I./include/uapi -Iinclude/generated/uapi -include ./include/linux/kconfig.h -D__KERNEL__ -Wall -Wundef -Wstrict-prototypes -Wno-trigraphs -fno-strict-aliasing -fno-common -Werror-implicit-function-declaration -Wno-format-security -std=gnu89 -m64 -mno-80387 -mno-fp-ret-in-387 -mtune=generic -mno-red-zone -mcmodel=kernel -funit-at-a-time -maccumulate-outgoing-args -DCONFIG_X86_X32_ABI -DCONFIG_AS_CFI=1 -DCONFIG_AS_CFI_SIGNAL_FRAME=1 -DCONFIG_AS_CFI_SECTIONS=1 -DCONFIG_AS_FXSAVEQ=1 -DCONFIG_AS_SSSE3=1 -DCONFIG_AS_CRC32=1 -DCONFIG_AS_AVX=1 -DCONFIG_AS_AVX2=1 -pipe -Wno-sign-compare -fno-asynchronous-unwind-tables -mno-sse -mno-mmx -mno-sse2 -mno-3dnow -mno-avx -fno-delete-null-pointer-checks -O2 --param=allow-store-data-races=0 -Wframe-larger-than=1024 -fstack-protector -Wno-unused-but-set-variable -fno-omit-frame-pointer -fno-optimize-sibling-calls -fno-var-tracking-assignments -pg -mfentry -DCC_USING_FENTRY -Wdeclaration-after-statement -Wno-pointer-sign -fno-strict-overflow -fconserve-stack -Werror=implicit-int -Werror=strict-prototypes -DCC_HAVE_ASM_GOTO -DNV_MODULE_INSTANCE=0 -DNV_BUILD_MODULE_INSTANCES=0 -UDEBUG -U_DEBUG -DNDEBUG -I/var/lib/dkms/nvidia-340/340.76/build -Wall -MD -Wsign-compare -Wno-cast-qual -Wno-error -D__KERNEL__ -DMODULE -DNVRM -DNV_VERSION_STRING=\"340.76\" -Wno-unused-function -Wuninitialized -fno-strict-aliasing -mno-red-zone -mcmodel=kernel -DNV_UVM_ENABLE -D__linux__ -DNV_DEV_NAME=\"nvidia\"  -DMODULE  -D"KBUILD_STR(s)=#s" -D"KBUILD_BASENAME=KBUILD_STR(nv_mempool)"  -D"KBUILD_MODNAME=KBUILD_STR(nvidia)" -c -o /var/lib/dkms/nvidia-340/340.76/build/.tmp_nv-mempool.o /var/lib/dkms/nvidia-340/340.76/build/nv-mempool.c
In file included from include/uapi/linux/stddef.h:1:0,
                 from include/linux/stddef.h:4,
                 from ./include/uapi/linux/posix_types.h:4,
                 from include/uapi/linux/types.h:13,
                 from include/linux/types.h:5,
                 from include/uapi/linux/capability.h:16,
                 from include/linux/capability.h:15,
                 from include/linux/sched.h:15,
                 from include/linux/utsname.h:5,
                 from /var/lib/dkms/nvidia-340/340.76/build/nv-linux.h:44,
                 from /var/lib/dkms/nvidia-340/340.76/build/nv-mempool.c:15:
include/asm-generic/qrwlock.h: In function ‘queue_write_trylock’:
include/asm-generic/qrwlock.h:93:35: warning: comparison between signed and unsigned integer expressions [-Wsign-compare]
          cnts, cnts | _QW_LOCKED) == cnts);
                                   ^
include/linux/compiler.h:163:40: note: in definition of macro ‘likely’
 # define likely(x) __builtin_expect(!!(x), 1)
                                        ^
In file included from include/uapi/linux/stddef.h:1:0,
                 from include/linux/stddef.h:4,
                 from ./include/uapi/linux/posix_types.h:4,
                 from include/uapi/linux/types.h:13,
                 from include/linux/types.h:5,
                 from include/uapi/linux/capability.h:16,
                 from include/linux/capability.h:15,
                 from include/linux/sched.h:15,
                 from include/linux/utsname.h:5,
                 from /var/lib/dkms/nvidia-340/340.76/build/nv-linux.h:44,
                 from /var/lib/dkms/nvidia-340/340.76/build/nv-mempool.c:15:
./arch/x86/include/asm/uaccess.h: In function ‘copy_from_user’:
./arch/x86/include/asm/uaccess.h:712:26: warning: comparison between signed and unsigned integer expressions [-Wsign-compare]
  if (likely(sz < 0 || sz >= n))
                          ^
include/linux/compiler.h:163:40: note: in definition of macro ‘likely’
 # define likely(x) __builtin_expect(!!(x), 1)
                                        ^
./arch/x86/include/asm/uaccess.h: In function ‘copy_to_user’:
./arch/x86/include/asm/uaccess.h:730:26: warning: comparison between signed and unsigned integer expressions [-Wsign-compare]
  if (likely(sz < 0 || sz >= n))
                          ^
include/linux/compiler.h:163:40: note: in definition of macro ‘likely’
 # define likely(x) __builtin_expect(!!(x), 1)
                                        ^
  if [ "-pg" = "-pg" ]; then if [ /var/lib/dkms/nvidia-340/340.76/build/nv-mempool.o != "scripts/mod/empty.o" ]; then ./scripts/recordmcount  "/var/lib/dkms/nvidia-340/340.76/build/nv-mempool.o"; fi; fi;
  cc -Wp,-MD,/var/lib/dkms/nvidia-340/340.76/build/.nv-mmap.o.d  -nostdinc -isystem /usr/lib/gcc/x86_64-linux-gnu/4.8/include -I./arch/x86/include -Iarch/x86/include/generated/uapi -Iarch/x86/include/generated  -Iinclude -I./arch/x86/include/uapi -Iarch/x86/include/generated/uapi -I./include/uapi -Iinclude/generated/uapi -include ./include/linux/kconfig.h -D__KERNEL__ -Wall -Wundef -Wstrict-prototypes -Wno-trigraphs -fno-strict-aliasing -fno-common -Werror-implicit-function-declaration -Wno-format-security -std=gnu89 -m64 -mno-80387 -mno-fp-ret-in-387 -mtune=generic -mno-red-zone -mcmodel=kernel -funit-at-a-time -maccumulate-outgoing-args -DCONFIG_X86_X32_ABI -DCONFIG_AS_CFI=1 -DCONFIG_AS_CFI_SIGNAL_FRAME=1 -DCONFIG_AS_CFI_SECTIONS=1 -DCONFIG_AS_FXSAVEQ=1 -DCONFIG_AS_SSSE3=1 -DCONFIG_AS_CRC32=1 -DCONFIG_AS_AVX=1 -DCONFIG_AS_AVX2=1 -pipe -Wno-sign-compare -fno-asynchronous-unwind-tables -mno-sse -mno-mmx -mno-sse2 -mno-3dnow -mno-avx -fno-delete-null-pointer-checks -O2 --param=allow-store-data-races=0 -Wframe-larger-than=1024 -fstack-protector -Wno-unused-but-set-variable -fno-omit-frame-pointer -fno-optimize-sibling-calls -fno-var-tracking-assignments -pg -mfentry -DCC_USING_FENTRY -Wdeclaration-after-statement -Wno-pointer-sign -fno-strict-overflow -fconserve-stack -Werror=implicit-int -Werror=strict-prototypes -DCC_HAVE_ASM_GOTO -DNV_MODULE_INSTANCE=0 -DNV_BUILD_MODULE_INSTANCES=0 -UDEBUG -U_DEBUG -DNDEBUG -I/var/lib/dkms/nvidia-340/340.76/build -Wall -MD -Wsign-compare -Wno-cast-qual -Wno-error -D__KERNEL__ -DMODULE -DNVRM -DNV_VERSION_STRING=\"340.76\" -Wno-unused-function -Wuninitialized -fno-strict-aliasing -mno-red-zone -mcmodel=kernel -DNV_UVM_ENABLE -D__linux__ -DNV_DEV_NAME=\"nvidia\"  -DMODULE  -D"KBUILD_STR(s)=#s" -D"KBUILD_BASENAME=KBUILD_STR(nv_mmap)"  -D"KBUILD_MODNAME=KBUILD_STR(nvidia)" -c -o /var/lib/dkms/nvidia-340/340.76/build/.tmp_nv-mmap.o /var/lib/dkms/nvidia-340/340.76/build/nv-mmap.c
In file included from include/uapi/linux/stddef.h:1:0,
                 from include/linux/stddef.h:4,
                 from ./include/uapi/linux/posix_types.h:4,
                 from include/uapi/linux/types.h:13,
                 from include/linux/types.h:5,
                 from include/uapi/linux/capability.h:16,
                 from include/linux/capability.h:15,
                 from include/linux/sched.h:15,
                 from include/linux/utsname.h:5,
                 from /var/lib/dkms/nvidia-340/340.76/build/nv-linux.h:44,
                 from /var/lib/dkms/nvidia-340/340.76/build/nv-mmap.c:15:
include/asm-generic/qrwlock.h: In function ‘queue_write_trylock’:
include/asm-generic/qrwlock.h:93:35: warning: comparison between signed and unsigned integer expressions [-Wsign-compare]
          cnts, cnts | _QW_LOCKED) == cnts);
                                   ^
include/linux/compiler.h:163:40: note: in definition of macro ‘likely’
 # define likely(x) __builtin_expect(!!(x), 1)
                                        ^
In file included from include/uapi/linux/stddef.h:1:0,
                 from include/linux/stddef.h:4,
                 from ./include/uapi/linux/posix_types.h:4,
                 from include/uapi/linux/types.h:13,
                 from include/linux/types.h:5,
                 from include/uapi/linux/capability.h:16,
                 from include/linux/capability.h:15,
                 from include/linux/sched.h:15,
                 from include/linux/utsname.h:5,
                 from /var/lib/dkms/nvidia-340/340.76/build/nv-linux.h:44,
                 from /var/lib/dkms/nvidia-340/340.76/build/nv-mmap.c:15:
./arch/x86/include/asm/uaccess.h: In function ‘copy_from_user’:
./arch/x86/include/asm/uaccess.h:712:26: warning: comparison between signed and unsigned integer expressions [-Wsign-compare]
  if (likely(sz < 0 || sz >= n))
                          ^
include/linux/compiler.h:163:40: note: in definition of macro ‘likely’
 # define likely(x) __builtin_expect(!!(x), 1)
                                        ^
./arch/x86/include/asm/uaccess.h: In function ‘copy_to_user’:
./arch/x86/include/asm/uaccess.h:730:26: warning: comparison between signed and unsigned integer expressions [-Wsign-compare]
  if (likely(sz < 0 || sz >= n))
                          ^
include/linux/compiler.h:163:40: note: in definition of macro ‘likely’
 # define likely(x) __builtin_expect(!!(x), 1)
                                        ^
  if [ "-pg" = "-pg" ]; then if [ /var/lib/dkms/nvidia-340/340.76/build/nv-mmap.o != "scripts/mod/empty.o" ]; then ./scripts/recordmcount  "/var/lib/dkms/nvidia-340/340.76/build/nv-mmap.o"; fi; fi;
  cc -Wp,-MD,/var/lib/dkms/nvidia-340/340.76/build/.nv-p2p.o.d  -nostdinc -isystem /usr/lib/gcc/x86_64-linux-gnu/4.8/include -I./arch/x86/include -Iarch/x86/include/generated/uapi -Iarch/x86/include/generated  -Iinclude -I./arch/x86/include/uapi -Iarch/x86/include/generated/uapi -I./include/uapi -Iinclude/generated/uapi -include ./include/linux/kconfig.h -D__KERNEL__ -Wall -Wundef -Wstrict-prototypes -Wno-trigraphs -fno-strict-aliasing -fno-common -Werror-implicit-function-declaration -Wno-format-security -std=gnu89 -m64 -mno-80387 -mno-fp-ret-in-387 -mtune=generic -mno-red-zone -mcmodel=kernel -funit-at-a-time -maccumulate-outgoing-args -DCONFIG_X86_X32_ABI -DCONFIG_AS_CFI=1 -DCONFIG_AS_CFI_SIGNAL_FRAME=1 -DCONFIG_AS_CFI_SECTIONS=1 -DCONFIG_AS_FXSAVEQ=1 -DCONFIG_AS_SSSE3=1 -DCONFIG_AS_CRC32=1 -DCONFIG_AS_AVX=1 -DCONFIG_AS_AVX2=1 -pipe -Wno-sign-compare -fno-asynchronous-unwind-tables -mno-sse -mno-mmx -mno-sse2 -mno-3dnow -mno-avx -fno-delete-null-pointer-checks -O2 --param=allow-store-data-races=0 -Wframe-larger-than=1024 -fstack-protector -Wno-unused-but-set-variable -fno-omit-frame-pointer -fno-optimize-sibling-calls -fno-var-tracking-assignments -pg -mfentry -DCC_USING_FENTRY -Wdeclaration-after-statement -Wno-pointer-sign -fno-strict-overflow -fconserve-stack -Werror=implicit-int -Werror=strict-prototypes -DCC_HAVE_ASM_GOTO -DNV_MODULE_INSTANCE=0 -DNV_BUILD_MODULE_INSTANCES=0 -UDEBUG -U_DEBUG -DNDEBUG -I/var/lib/dkms/nvidia-340/340.76/build -Wall -MD -Wsign-compare -Wno-cast-qual -Wno-error -D__KERNEL__ -DMODULE -DNVRM -DNV_VERSION_STRING=\"340.76\" -Wno-unused-function -Wuninitialized -fno-strict-aliasing -mno-red-zone -mcmodel=kernel -DNV_UVM_ENABLE -D__linux__ -DNV_DEV_NAME=\"nvidia\"  -DMODULE  -D"KBUILD_STR(s)=#s" -D"KBUILD_BASENAME=KBUILD_STR(nv_p2p)"  -D"KBUILD_MODNAME=KBUILD_STR(nvidia)" -c -o /var/lib/dkms/nvidia-340/340.76/build/.tmp_nv-p2p.o /var/lib/dkms/nvidia-340/340.76/build/nv-p2p.c
In file included from include/uapi/linux/stddef.h:1:0,
                 from include/linux/stddef.h:4,
                 from ./include/uapi/linux/posix_types.h:4,
                 from include/uapi/linux/types.h:13,
                 from include/linux/types.h:5,
                 from include/uapi/linux/capability.h:16,
                 from include/linux/capability.h:15,
                 from include/linux/sched.h:15,
                 from include/linux/utsname.h:5,
                 from /var/lib/dkms/nvidia-340/340.76/build/nv-linux.h:44,
                 from /var/lib/dkms/nvidia-340/340.76/build/nv-p2p.c:15:
include/asm-generic/qrwlock.h: In function ‘queue_write_trylock’:
include/asm-generic/qrwlock.h:93:35: warning: comparison between signed and unsigned integer expressions [-Wsign-compare]
          cnts, cnts | _QW_LOCKED) == cnts);
                                   ^
include/linux/compiler.h:163:40: note: in definition of macro ‘likely’
 # define likely(x) __builtin_expect(!!(x), 1)
                                        ^
In file included from include/uapi/linux/stddef.h:1:0,
                 from include/linux/stddef.h:4,
                 from ./include/uapi/linux/posix_types.h:4,
                 from include/uapi/linux/types.h:13,
                 from include/linux/types.h:5,
                 from include/uapi/linux/capability.h:16,
                 from include/linux/capability.h:15,
                 from include/linux/sched.h:15,
                 from include/linux/utsname.h:5,
                 from /var/lib/dkms/nvidia-340/340.76/build/nv-linux.h:44,
                 from /var/lib/dkms/nvidia-340/340.76/build/nv-p2p.c:15:
./arch/x86/include/asm/uaccess.h: In function ‘copy_from_user’:
./arch/x86/include/asm/uaccess.h:712:26: warning: comparison between signed and unsigned integer expressions [-Wsign-compare]
  if (likely(sz < 0 || sz >= n))
                          ^
include/linux/compiler.h:163:40: note: in definition of macro ‘likely’
 # define likely(x) __builtin_expect(!!(x), 1)
                                        ^
./arch/x86/include/asm/uaccess.h: In function ‘copy_to_user’:
./arch/x86/include/asm/uaccess.h:730:26: warning: comparison between signed and unsigned integer expressions [-Wsign-compare]
  if (likely(sz < 0 || sz >= n))
                          ^
include/linux/compiler.h:163:40: note: in definition of macro ‘likely’
 # define likely(x) __builtin_expect(!!(x), 1)
                                        ^
  if [ "-pg" = "-pg" ]; then if [ /var/lib/dkms/nvidia-340/340.76/build/nv-p2p.o != "scripts/mod/empty.o" ]; then ./scripts/recordmcount  "/var/lib/dkms/nvidia-340/340.76/build/nv-p2p.o"; fi; fi;
  cc -Wp,-MD,/var/lib/dkms/nvidia-340/340.76/build/.nv-pat.o.d  -nostdinc -isystem /usr/lib/gcc/x86_64-linux-gnu/4.8/include -I./arch/x86/include -Iarch/x86/include/generated/uapi -Iarch/x86/include/generated  -Iinclude -I./arch/x86/include/uapi -Iarch/x86/include/generated/uapi -I./include/uapi -Iinclude/generated/uapi -include ./include/linux/kconfig.h -D__KERNEL__ -Wall -Wundef -Wstrict-prototypes -Wno-trigraphs -fno-strict-aliasing -fno-common -Werror-implicit-function-declaration -Wno-format-security -std=gnu89 -m64 -mno-80387 -mno-fp-ret-in-387 -mtune=generic -mno-red-zone -mcmodel=kernel -funit-at-a-time -maccumulate-outgoing-args -DCONFIG_X86_X32_ABI -DCONFIG_AS_CFI=1 -DCONFIG_AS_CFI_SIGNAL_FRAME=1 -DCONFIG_AS_CFI_SECTIONS=1 -DCONFIG_AS_FXSAVEQ=1 -DCONFIG_AS_SSSE3=1 -DCONFIG_AS_CRC32=1 -DCONFIG_AS_AVX=1 -DCONFIG_AS_AVX2=1 -pipe -Wno-sign-compare -fno-asynchronous-unwind-tables -mno-sse -mno-mmx -mno-sse2 -mno-3dnow -mno-avx -fno-delete-null-pointer-checks -O2 --param=allow-store-data-races=0 -Wframe-larger-than=1024 -fstack-protector -Wno-unused-but-set-variable -fno-omit-frame-pointer -fno-optimize-sibling-calls -fno-var-tracking-assignments -pg -mfentry -DCC_USING_FENTRY -Wdeclaration-after-statement -Wno-pointer-sign -fno-strict-overflow -fconserve-stack -Werror=implicit-int -Werror=strict-prototypes -DCC_HAVE_ASM_GOTO -DNV_MODULE_INSTANCE=0 -DNV_BUILD_MODULE_INSTANCES=0 -UDEBUG -U_DEBUG -DNDEBUG -I/var/lib/dkms/nvidia-340/340.76/build -Wall -MD -Wsign-compare -Wno-cast-qual -Wno-error -D__KERNEL__ -DMODULE -DNVRM -DNV_VERSION_STRING=\"340.76\" -Wno-unused-function -Wuninitialized -fno-strict-aliasing -mno-red-zone -mcmodel=kernel -DNV_UVM_ENABLE -D__linux__ -DNV_DEV_NAME=\"nvidia\"  -DMODULE  -D"KBUILD_STR(s)=#s" -D"KBUILD_BASENAME=KBUILD_STR(nv_pat)"  -D"KBUILD_MODNAME=KBUILD_STR(nvidia)" -c -o /var/lib/dkms/nvidia-340/340.76/build/.tmp_nv-pat.o /var/lib/dkms/nvidia-340/340.76/build/nv-pat.c
In file included from include/uapi/linux/stddef.h:1:0,
                 from include/linux/stddef.h:4,
                 from ./include/uapi/linux/posix_types.h:4,
                 from include/uapi/linux/types.h:13,
                 from include/linux/types.h:5,
                 from include/uapi/linux/capability.h:16,
                 from include/linux/capability.h:15,
                 from include/linux/sched.h:15,
                 from include/linux/utsname.h:5,
                 from /var/lib/dkms/nvidia-340/340.76/build/nv-linux.h:44,
                 from /var/lib/dkms/nvidia-340/340.76/build/nv-pat.c:15:
include/asm-generic/qrwlock.h: In function ‘queue_write_trylock’:
include/asm-generic/qrwlock.h:93:35: warning: comparison between signed and unsigned integer expressions [-Wsign-compare]
          cnts, cnts | _QW_LOCKED) == cnts);
                                   ^
include/linux/compiler.h:163:40: note: in definition of macro ‘likely’
 # define likely(x) __builtin_expect(!!(x), 1)
                                        ^
In file included from include/uapi/linux/stddef.h:1:0,
                 from include/linux/stddef.h:4,
                 from ./include/uapi/linux/posix_types.h:4,
                 from include/uapi/linux/types.h:13,
                 from include/linux/types.h:5,
                 from include/uapi/linux/capability.h:16,
                 from include/linux/capability.h:15,
                 from include/linux/sched.h:15,
                 from include/linux/utsname.h:5,
                 from /var/lib/dkms/nvidia-340/340.76/build/nv-linux.h:44,
                 from /var/lib/dkms/nvidia-340/340.76/build/nv-pat.c:15:
./arch/x86/include/asm/uaccess.h: In function ‘copy_from_user’:
./arch/x86/include/asm/uaccess.h:712:26: warning: comparison between signed and unsigned integer expressions [-Wsign-compare]
  if (likely(sz < 0 || sz >= n))
                          ^
include/linux/compiler.h:163:40: note: in definition of macro ‘likely’
 # define likely(x) __builtin_expect(!!(x), 1)
                                        ^
./arch/x86/include/asm/uaccess.h: In function ‘copy_to_user’:
./arch/x86/include/asm/uaccess.h:730:26: warning: comparison between signed and unsigned integer expressions [-Wsign-compare]
  if (likely(sz < 0 || sz >= n))
                          ^
include/linux/compiler.h:163:40: note: in definition of macro ‘likely’
 # define likely(x) __builtin_expect(!!(x), 1)
                                        ^
/var/lib/dkms/nvidia-340/340.76/build/nv-pat.c: In function ‘nv_disable_caches’:
/var/lib/dkms/nvidia-340/340.76/build/nv-pat.c:38:5: error: implicit declaration of function ‘read_cr4’ [-Werror=implicit-function-declaration]
     *cr4 = read_cr4();
     ^
/var/lib/dkms/nvidia-340/340.76/build/nv-pat.c:39:5: error: implicit declaration of function ‘write_cr4’ [-Werror=implicit-function-declaration]
     if (*cr4 & 0x80) write_cr4(*cr4 & ~0x80);
     ^
cc1: some warnings being treated as errors
make[2]: *** [/var/lib/dkms/nvidia-340/340.76/build/nv-pat.o] Error 1
  cc -Wp,-MD,/var/lib/dkms/nvidia-340/340.76/build/.nv-procfs.o.d  -nostdinc -isystem /usr/lib/gcc/x86_64-linux-gnu/4.8/include -I./arch/x86/include -Iarch/x86/include/generated/uapi -Iarch/x86/include/generated  -Iinclude -I./arch/x86/include/uapi -Iarch/x86/include/generated/uapi -I./include/uapi -Iinclude/generated/uapi -include ./include/linux/kconfig.h -D__KERNEL__ -Wall -Wundef -Wstrict-prototypes -Wno-trigraphs -fno-strict-aliasing -fno-common -Werror-implicit-function-declaration -Wno-format-security -std=gnu89 -m64 -mno-80387 -mno-fp-ret-in-387 -mtune=generic -mno-red-zone -mcmodel=kernel -funit-at-a-time -maccumulate-outgoing-args -DCONFIG_X86_X32_ABI -DCONFIG_AS_CFI=1 -DCONFIG_AS_CFI_SIGNAL_FRAME=1 -DCONFIG_AS_CFI_SECTIONS=1 -DCONFIG_AS_FXSAVEQ=1 -DCONFIG_AS_SSSE3=1 -DCONFIG_AS_CRC32=1 -DCONFIG_AS_AVX=1 -DCONFIG_AS_AVX2=1 -pipe -Wno-sign-compare -fno-asynchronous-unwind-tables -mno-sse -mno-mmx -mno-sse2 -mno-3dnow -mno-avx -fno-delete-null-pointer-checks -O2 --param=allow-store-data-races=0 -Wframe-larger-than=1024 -fstack-protector -Wno-unused-but-set-variable -fno-omit-frame-pointer -fno-optimize-sibling-calls -fno-var-tracking-assignments -pg -mfentry -DCC_USING_FENTRY -Wdeclaration-after-statement -Wno-pointer-sign -fno-strict-overflow -fconserve-stack -Werror=implicit-int -Werror=strict-prototypes -DCC_HAVE_ASM_GOTO -DNV_MODULE_INSTANCE=0 -DNV_BUILD_MODULE_INSTANCES=0 -UDEBUG -U_DEBUG -DNDEBUG -I/var/lib/dkms/nvidia-340/340.76/build -Wall -MD -Wsign-compare -Wno-cast-qual -Wno-error -D__KERNEL__ -DMODULE -DNVRM -DNV_VERSION_STRING=\"340.76\" -Wno-unused-function -Wuninitialized -fno-strict-aliasing -mno-red-zone -mcmodel=kernel -DNV_UVM_ENABLE -D__linux__ -DNV_DEV_NAME=\"nvidia\"  -DMODULE  -D"KBUILD_STR(s)=#s" -D"KBUILD_BASENAME=KBUILD_STR(nv_procfs)"  -D"KBUILD_MODNAME=KBUILD_STR(nvidia)" -c -o /var/lib/dkms/nvidia-340/340.76/build/.tmp_nv-procfs.o /var/lib/dkms/nvidia-340/340.76/build/nv-procfs.c
In file included from include/uapi/linux/stddef.h:1:0,
                 from include/linux/stddef.h:4,
                 from ./include/uapi/linux/posix_types.h:4,
                 from include/uapi/linux/types.h:13,
                 from include/linux/types.h:5,
                 from include/uapi/linux/capability.h:16,
                 from include/linux/capability.h:15,
                 from include/linux/sched.h:15,
                 from include/linux/utsname.h:5,
                 from /var/lib/dkms/nvidia-340/340.76/build/nv-linux.h:44,
                 from /var/lib/dkms/nvidia-340/340.76/build/nv-procfs.c:15:
include/asm-generic/qrwlock.h: In function ‘queue_write_trylock’:
include/asm-generic/qrwlock.h:93:35: warning: comparison between signed and unsigned integer expressions [-Wsign-compare]
          cnts, cnts | _QW_LOCKED) == cnts);
                                   ^
include/linux/compiler.h:163:40: note: in definition of macro ‘likely’
 # define likely(x) __builtin_expect(!!(x), 1)
                                        ^
In file included from include/uapi/linux/stddef.h:1:0,
                 from include/linux/stddef.h:4,
                 from ./include/uapi/linux/posix_types.h:4,
                 from include/uapi/linux/types.h:13,
                 from include/linux/types.h:5,
                 from include/uapi/linux/capability.h:16,
                 from include/linux/capability.h:15,
                 from include/linux/sched.h:15,
                 from include/linux/utsname.h:5,
                 from /var/lib/dkms/nvidia-340/340.76/build/nv-linux.h:44,
                 from /var/lib/dkms/nvidia-340/340.76/build/nv-procfs.c:15:
./arch/x86/include/asm/uaccess.h: In function ‘copy_from_user’:
./arch/x86/include/asm/uaccess.h:712:26: warning: comparison between signed and unsigned integer expressions [-Wsign-compare]
  if (likely(sz < 0 || sz >= n))
                          ^
include/linux/compiler.h:163:40: note: in definition of macro ‘likely’
 # define likely(x) __builtin_expect(!!(x), 1)
                                        ^
./arch/x86/include/asm/uaccess.h: In function ‘copy_to_user’:
./arch/x86/include/asm/uaccess.h:730:26: warning: comparison between signed and unsigned integer expressions [-Wsign-compare]
  if (likely(sz < 0 || sz >= n))
                          ^
include/linux/compiler.h:163:40: note: in definition of macro ‘likely’
 # define likely(x) __builtin_expect(!!(x), 1)
                                        ^
  if [ "-pg" = "-pg" ]; then if [ /var/lib/dkms/nvidia-340/340.76/build/nv-procfs.o != "scripts/mod/empty.o" ]; then ./scripts/recordmcount  "/var/lib/dkms/nvidia-340/340.76/build/nv-procfs.o"; fi; fi;
  cc -Wp,-MD,/var/lib/dkms/nvidia-340/340.76/build/.nv-usermap.o.d  -nostdinc -isystem /usr/lib/gcc/x86_64-linux-gnu/4.8/include -I./arch/x86/include -Iarch/x86/include/generated/uapi -Iarch/x86/include/generated  -Iinclude -I./arch/x86/include/uapi -Iarch/x86/include/generated/uapi -I./include/uapi -Iinclude/generated/uapi -include ./include/linux/kconfig.h -D__KERNEL__ -Wall -Wundef -Wstrict-prototypes -Wno-trigraphs -fno-strict-aliasing -fno-common -Werror-implicit-function-declaration -Wno-format-security -std=gnu89 -m64 -mno-80387 -mno-fp-ret-in-387 -mtune=generic -mno-red-zone -mcmodel=kernel -funit-at-a-time -maccumulate-outgoing-args -DCONFIG_X86_X32_ABI -DCONFIG_AS_CFI=1 -DCONFIG_AS_CFI_SIGNAL_FRAME=1 -DCONFIG_AS_CFI_SECTIONS=1 -DCONFIG_AS_FXSAVEQ=1 -DCONFIG_AS_SSSE3=1 -DCONFIG_AS_CRC32=1 -DCONFIG_AS_AVX=1 -DCONFIG_AS_AVX2=1 -pipe -Wno-sign-compare -fno-asynchronous-unwind-tables -mno-sse -mno-mmx -mno-sse2 -mno-3dnow -mno-avx -fno-delete-null-pointer-checks -O2 --param=allow-store-data-races=0 -Wframe-larger-than=1024 -fstack-protector -Wno-unused-but-set-variable -fno-omit-frame-pointer -fno-optimize-sibling-calls -fno-var-tracking-assignments -pg -mfentry -DCC_USING_FENTRY -Wdeclaration-after-statement -Wno-pointer-sign -fno-strict-overflow -fconserve-stack -Werror=implicit-int -Werror=strict-prototypes -DCC_HAVE_ASM_GOTO -DNV_MODULE_INSTANCE=0 -DNV_BUILD_MODULE_INSTANCES=0 -UDEBUG -U_DEBUG -DNDEBUG -I/var/lib/dkms/nvidia-340/340.76/build -Wall -MD -Wsign-compare -Wno-cast-qual -Wno-error -D__KERNEL__ -DMODULE -DNVRM -DNV_VERSION_STRING=\"340.76\" -Wno-unused-function -Wuninitialized -fno-strict-aliasing -mno-red-zone -mcmodel=kernel -DNV_UVM_ENABLE -D__linux__ -DNV_DEV_NAME=\"nvidia\"  -DMODULE  -D"KBUILD_STR(s)=#s" -D"KBUILD_BASENAME=KBUILD_STR(nv_usermap)"  -D"KBUILD_MODNAME=KBUILD_STR(nvidia)" -c -o /var/lib/dkms/nvidia-340/340.76/build/.tmp_nv-usermap.o /var/lib/dkms/nvidia-340/340.76/build/nv-usermap.c
In file included from include/uapi/linux/stddef.h:1:0,
                 from include/linux/stddef.h:4,
                 from ./include/uapi/linux/posix_types.h:4,
                 from include/uapi/linux/types.h:13,
                 from include/linux/types.h:5,
                 from include/uapi/linux/capability.h:16,
                 from include/linux/capability.h:15,
                 from include/linux/sched.h:15,
                 from include/linux/utsname.h:5,
                 from /var/lib/dkms/nvidia-340/340.76/build/nv-linux.h:44,
                 from /var/lib/dkms/nvidia-340/340.76/build/nv-usermap.c:15:
include/asm-generic/qrwlock.h: In function ‘queue_write_trylock’:
include/asm-generic/qrwlock.h:93:35: warning: comparison between signed and unsigned integer expressions [-Wsign-compare]
          cnts, cnts | _QW_LOCKED) == cnts);
                                   ^
include/linux/compiler.h:163:40: note: in definition of macro ‘likely’
 # define likely(x) __builtin_expect(!!(x), 1)
                                        ^
In file included from include/uapi/linux/stddef.h:1:0,
                 from include/linux/stddef.h:4,
                 from ./include/uapi/linux/posix_types.h:4,
                 from include/uapi/linux/types.h:13,
                 from include/linux/types.h:5,
                 from include/uapi/linux/capability.h:16,
                 from include/linux/capability.h:15,
                 from include/linux/sched.h:15,
                 from include/linux/utsname.h:5,
                 from /var/lib/dkms/nvidia-340/340.76/build/nv-linux.h:44,
                 from /var/lib/dkms/nvidia-340/340.76/build/nv-usermap.c:15:
./arch/x86/include/asm/uaccess.h: In function ‘copy_from_user’:
./arch/x86/include/asm/uaccess.h:712:26: warning: comparison between signed and unsigned integer expressions [-Wsign-compare]
  if (likely(sz < 0 || sz >= n))
                          ^
include/linux/compiler.h:163:40: note: in definition of macro ‘likely’
 # define likely(x) __builtin_expect(!!(x), 1)
                                        ^
./arch/x86/include/asm/uaccess.h: In function ‘copy_to_user’:
./arch/x86/include/asm/uaccess.h:730:26: warning: comparison between signed and unsigned integer expressions [-Wsign-compare]
  if (likely(sz < 0 || sz >= n))
                          ^
include/linux/compiler.h:163:40: note: in definition of macro ‘likely’
 # define likely(x) __builtin_expect(!!(x), 1)
                                        ^
  if [ "-pg" = "-pg" ]; then if [ /var/lib/dkms/nvidia-340/340.76/build/nv-usermap.o != "scripts/mod/empty.o" ]; then ./scripts/recordmcount  "/var/lib/dkms/nvidia-340/340.76/build/nv-usermap.o"; fi; fi;
  cc -Wp,-MD,/var/lib/dkms/nvidia-340/340.76/build/.nv-vm.o.d  -nostdinc -isystem /usr/lib/gcc/x86_64-linux-gnu/4.8/include -I./arch/x86/include -Iarch/x86/include/generated/uapi -Iarch/x86/include/generated  -Iinclude -I./arch/x86/include/uapi -Iarch/x86/include/generated/uapi -I./include/uapi -Iinclude/generated/uapi -include ./include/linux/kconfig.h -D__KERNEL__ -Wall -Wundef -Wstrict-prototypes -Wno-trigraphs -fno-strict-aliasing -fno-common -Werror-implicit-function-declaration -Wno-format-security -std=gnu89 -m64 -mno-80387 -mno-fp-ret-in-387 -mtune=generic -mno-red-zone -mcmodel=kernel -funit-at-a-time -maccumulate-outgoing-args -DCONFIG_X86_X32_ABI -DCONFIG_AS_CFI=1 -DCONFIG_AS_CFI_SIGNAL_FRAME=1 -DCONFIG_AS_CFI_SECTIONS=1 -DCONFIG_AS_FXSAVEQ=1 -DCONFIG_AS_SSSE3=1 -DCONFIG_AS_CRC32=1 -DCONFIG_AS_AVX=1 -DCONFIG_AS_AVX2=1 -pipe -Wno-sign-compare -fno-asynchronous-unwind-tables -mno-sse -mno-mmx -mno-sse2 -mno-3dnow -mno-avx -fno-delete-null-pointer-checks -O2 --param=allow-store-data-races=0 -Wframe-larger-than=1024 -fstack-protector -Wno-unused-but-set-variable -fno-omit-frame-pointer -fno-optimize-sibling-calls -fno-var-tracking-assignments -pg -mfentry -DCC_USING_FENTRY -Wdeclaration-after-statement -Wno-pointer-sign -fno-strict-overflow -fconserve-stack -Werror=implicit-int -Werror=strict-prototypes -DCC_HAVE_ASM_GOTO -DNV_MODULE_INSTANCE=0 -DNV_BUILD_MODULE_INSTANCES=0 -UDEBUG -U_DEBUG -DNDEBUG -I/var/lib/dkms/nvidia-340/340.76/build -Wall -MD -Wsign-compare -Wno-cast-qual -Wno-error -D__KERNEL__ -DMODULE -DNVRM -DNV_VERSION_STRING=\"340.76\" -Wno-unused-function -Wuninitialized -fno-strict-aliasing -mno-red-zone -mcmodel=kernel -DNV_UVM_ENABLE -D__linux__ -DNV_DEV_NAME=\"nvidia\"  -DMODULE  -D"KBUILD_STR(s)=#s" -D"KBUILD_BASENAME=KBUILD_STR(nv_vm)"  -D"KBUILD_MODNAME=KBUILD_STR(nvidia)" -c -o /var/lib/dkms/nvidia-340/340.76/build/.tmp_nv-vm.o /var/lib/dkms/nvidia-340/340.76/build/nv-vm.c
In file included from include/uapi/linux/stddef.h:1:0,
                 from include/linux/stddef.h:4,
                 from ./include/uapi/linux/posix_types.h:4,
                 from include/uapi/linux/types.h:13,
                 from include/linux/types.h:5,
                 from include/uapi/linux/capability.h:16,
                 from include/linux/capability.h:15,
                 from include/linux/sched.h:15,
                 from include/linux/utsname.h:5,
                 from /var/lib/dkms/nvidia-340/340.76/build/nv-linux.h:44,
                 from /var/lib/dkms/nvidia-340/340.76/build/nv-vm.c:14:
include/asm-generic/qrwlock.h: In function ‘queue_write_trylock’:
include/asm-generic/qrwlock.h:93:35: warning: comparison between signed and unsigned integer expressions [-Wsign-compare]
          cnts, cnts | _QW_LOCKED) == cnts);
                                   ^
include/linux/compiler.h:163:40: note: in definition of macro ‘likely’
 # define likely(x) __builtin_expect(!!(x), 1)
                                        ^
In file included from include/uapi/linux/stddef.h:1:0,
                 from include/linux/stddef.h:4,
                 from ./include/uapi/linux/posix_types.h:4,
                 from include/uapi/linux/types.h:13,
                 from include/linux/types.h:5,
                 from include/uapi/linux/capability.h:16,
                 from include/linux/capability.h:15,
                 from include/linux/sched.h:15,
                 from include/linux/utsname.h:5,
                 from /var/lib/dkms/nvidia-340/340.76/build/nv-linux.h:44,
                 from /var/lib/dkms/nvidia-340/340.76/build/nv-vm.c:14:
./arch/x86/include/asm/uaccess.h: In function ‘copy_from_user’:
./arch/x86/include/asm/uaccess.h:712:26: warning: comparison between signed and unsigned integer expressions [-Wsign-compare]
  if (likely(sz < 0 || sz >= n))
                          ^
include/linux/compiler.h:163:40: note: in definition of macro ‘likely’
 # define likely(x) __builtin_expect(!!(x), 1)
                                        ^
./arch/x86/include/asm/uaccess.h: In function ‘copy_to_user’:
./arch/x86/include/asm/uaccess.h:730:26: warning: comparison between signed and unsigned integer expressions [-Wsign-compare]
  if (likely(sz < 0 || sz >= n))
                          ^
include/linux/compiler.h:163:40: note: in definition of macro ‘likely’
 # define likely(x) __builtin_expect(!!(x), 1)
                                        ^
  if [ "-pg" = "-pg" ]; then if [ /var/lib/dkms/nvidia-340/340.76/build/nv-vm.o != "scripts/mod/empty.o" ]; then ./scripts/recordmcount  "/var/lib/dkms/nvidia-340/340.76/build/nv-vm.o"; fi; fi;
  cc -Wp,-MD,/var/lib/dkms/nvidia-340/340.76/build/.nv-vtophys.o.d  -nostdinc -isystem /usr/lib/gcc/x86_64-linux-gnu/4.8/include -I./arch/x86/include -Iarch/x86/include/generated/uapi -Iarch/x86/include/generated  -Iinclude -I./arch/x86/include/uapi -Iarch/x86/include/generated/uapi -I./include/uapi -Iinclude/generated/uapi -include ./include/linux/kconfig.h -D__KERNEL__ -Wall -Wundef -Wstrict-prototypes -Wno-trigraphs -fno-strict-aliasing -fno-common -Werror-implicit-function-declaration -Wno-format-security -std=gnu89 -m64 -mno-80387 -mno-fp-ret-in-387 -mtune=generic -mno-red-zone -mcmodel=kernel -funit-at-a-time -maccumulate-outgoing-args -DCONFIG_X86_X32_ABI -DCONFIG_AS_CFI=1 -DCONFIG_AS_CFI_SIGNAL_FRAME=1 -DCONFIG_AS_CFI_SECTIONS=1 -DCONFIG_AS_FXSAVEQ=1 -DCONFIG_AS_SSSE3=1 -DCONFIG_AS_CRC32=1 -DCONFIG_AS_AVX=1 -DCONFIG_AS_AVX2=1 -pipe -Wno-sign-compare -fno-asynchronous-unwind-tables -mno-sse -mno-mmx -mno-sse2 -mno-3dnow -mno-avx -fno-delete-null-pointer-checks -O2 --param=allow-store-data-races=0 -Wframe-larger-than=1024 -fstack-protector -Wno-unused-but-set-variable -fno-omit-frame-pointer -fno-optimize-sibling-calls -fno-var-tracking-assignments -pg -mfentry -DCC_USING_FENTRY -Wdeclaration-after-statement -Wno-pointer-sign -fno-strict-overflow -fconserve-stack -Werror=implicit-int -Werror=strict-prototypes -DCC_HAVE_ASM_GOTO -DNV_MODULE_INSTANCE=0 -DNV_BUILD_MODULE_INSTANCES=0 -UDEBUG -U_DEBUG -DNDEBUG -I/var/lib/dkms/nvidia-340/340.76/build -Wall -MD -Wsign-compare -Wno-cast-qual -Wno-error -D__KERNEL__ -DMODULE -DNVRM -DNV_VERSION_STRING=\"340.76\" -Wno-unused-function -Wuninitialized -fno-strict-aliasing -mno-red-zone -mcmodel=kernel -DNV_UVM_ENABLE -D__linux__ -DNV_DEV_NAME=\"nvidia\"  -DMODULE  -D"KBUILD_STR(s)=#s" -D"KBUILD_BASENAME=KBUILD_STR(nv_vtophys)"  -D"KBUILD_MODNAME=KBUILD_STR(nvidia)" -c -o /var/lib/dkms/nvidia-340/340.76/build/.tmp_nv-vtophys.o /var/lib/dkms/nvidia-340/340.76/build/nv-vtophys.c
In file included from include/uapi/linux/stddef.h:1:0,
                 from include/linux/stddef.h:4,
                 from ./include/uapi/linux/posix_types.h:4,
                 from include/uapi/linux/types.h:13,
                 from include/linux/types.h:5,
                 from include/uapi/linux/capability.h:16,
                 from include/linux/capability.h:15,
                 from include/linux/sched.h:15,
                 from include/linux/utsname.h:5,
                 from /var/lib/dkms/nvidia-340/340.76/build/nv-linux.h:44,
                 from /var/lib/dkms/nvidia-340/340.76/build/nv-vtophys.c:15:
include/asm-generic/qrwlock.h: In function ‘queue_write_trylock’:
include/asm-generic/qrwlock.h:93:35: warning: comparison between signed and unsigned integer expressions [-Wsign-compare]
          cnts, cnts | _QW_LOCKED) == cnts);
                                   ^
include/linux/compiler.h:163:40: note: in definition of macro ‘likely’
 # define likely(x) __builtin_expect(!!(x), 1)
                                        ^
In file included from include/uapi/linux/stddef.h:1:0,
                 from include/linux/stddef.h:4,
                 from ./include/uapi/linux/posix_types.h:4,
                 from include/uapi/linux/types.h:13,
                 from include/linux/types.h:5,
                 from include/uapi/linux/capability.h:16,
                 from include/linux/capability.h:15,
                 from include/linux/sched.h:15,
                 from include/linux/utsname.h:5,
                 from /var/lib/dkms/nvidia-340/340.76/build/nv-linux.h:44,
                 from /var/lib/dkms/nvidia-340/340.76/build/nv-vtophys.c:15:
./arch/x86/include/asm/uaccess.h: In function ‘copy_from_user’:
./arch/x86/include/asm/uaccess.h:712:26: warning: comparison between signed and unsigned integer expressions [-Wsign-compare]
  if (likely(sz < 0 || sz >= n))
                          ^
include/linux/compiler.h:163:40: note: in definition of macro ‘likely’
 # define likely(x) __builtin_expect(!!(x), 1)
                                        ^
./arch/x86/include/asm/uaccess.h: In function ‘copy_to_user’:
./arch/x86/include/asm/uaccess.h:730:26: warning: comparison between signed and unsigned integer expressions [-Wsign-compare]
  if (likely(sz < 0 || sz >= n))
                          ^
include/linux/compiler.h:163:40: note: in definition of macro ‘likely’
 # define likely(x) __builtin_expect(!!(x), 1)
                                        ^
  if [ "-pg" = "-pg" ]; then if [ /var/lib/dkms/nvidia-340/340.76/build/nv-vtophys.o != "scripts/mod/empty.o" ]; then ./scripts/recordmcount  "/var/lib/dkms/nvidia-340/340.76/build/nv-vtophys.o"; fi; fi;
  cc -Wp,-MD,/var/lib/dkms/nvidia-340/340.76/build/.os-interface.o.d  -nostdinc -isystem /usr/lib/gcc/x86_64-linux-gnu/4.8/include -I./arch/x86/include -Iarch/x86/include/generated/uapi -Iarch/x86/include/generated  -Iinclude -I./arch/x86/include/uapi -Iarch/x86/include/generated/uapi -I./include/uapi -Iinclude/generated/uapi -include ./include/linux/kconfig.h -D__KERNEL__ -Wall -Wundef -Wstrict-prototypes -Wno-trigraphs -fno-strict-aliasing -fno-common -Werror-implicit-function-declaration -Wno-format-security -std=gnu89 -m64 -mno-80387 -mno-fp-ret-in-387 -mtune=generic -mno-red-zone -mcmodel=kernel -funit-at-a-time -maccumulate-outgoing-args -DCONFIG_X86_X32_ABI -DCONFIG_AS_CFI=1 -DCONFIG_AS_CFI_SIGNAL_FRAME=1 -DCONFIG_AS_CFI_SECTIONS=1 -DCONFIG_AS_FXSAVEQ=1 -DCONFIG_AS_SSSE3=1 -DCONFIG_AS_CRC32=1 -DCONFIG_AS_AVX=1 -DCONFIG_AS_AVX2=1 -pipe -Wno-sign-compare -fno-asynchronous-unwind-tables -mno-sse -mno-mmx -mno-sse2 -mno-3dnow -mno-avx -fno-delete-null-pointer-checks -O2 --param=allow-store-data-races=0 -Wframe-larger-than=1024 -fstack-protector -Wno-unused-but-set-variable -fno-omit-frame-pointer -fno-optimize-sibling-calls -fno-var-tracking-assignments -pg -mfentry -DCC_USING_FENTRY -Wdeclaration-after-statement -Wno-pointer-sign -fno-strict-overflow -fconserve-stack -Werror=implicit-int -Werror=strict-prototypes -DCC_HAVE_ASM_GOTO -DNV_MODULE_INSTANCE=0 -DNV_BUILD_MODULE_INSTANCES=0 -UDEBUG -U_DEBUG -DNDEBUG -I/var/lib/dkms/nvidia-340/340.76/build -Wall -MD -Wsign-compare -Wno-cast-qual -Wno-error -D__KERNEL__ -DMODULE -DNVRM -DNV_VERSION_STRING=\"340.76\" -Wno-unused-function -Wuninitialized -fno-strict-aliasing -mno-red-zone -mcmodel=kernel -DNV_UVM_ENABLE -D__linux__ -DNV_DEV_NAME=\"nvidia\"  -DMODULE  -D"KBUILD_STR(s)=#s" -D"KBUILD_BASENAME=KBUILD_STR(os_interface)"  -D"KBUILD_MODNAME=KBUILD_STR(nvidia)" -c -o /var/lib/dkms/nvidia-340/340.76/build/.tmp_os-interface.o /var/lib/dkms/nvidia-340/340.76/build/os-interface.c
In file included from include/uapi/linux/stddef.h:1:0,
                 from include/linux/stddef.h:4,
                 from ./include/uapi/linux/posix_types.h:4,
                 from include/uapi/linux/types.h:13,
                 from include/linux/types.h:5,
                 from include/uapi/linux/capability.h:16,
                 from include/linux/capability.h:15,
                 from include/linux/sched.h:15,
                 from include/linux/utsname.h:5,
                 from /var/lib/dkms/nvidia-340/340.76/build/nv-linux.h:44,
                 from /var/lib/dkms/nvidia-340/340.76/build/os-interface.c:15:
include/asm-generic/qrwlock.h: In function ‘queue_write_trylock’:
include/asm-generic/qrwlock.h:93:35: warning: comparison between signed and unsigned integer expressions [-Wsign-compare]
          cnts, cnts | _QW_LOCKED) == cnts);
                                   ^
include/linux/compiler.h:163:40: note: in definition of macro ‘likely’
 # define likely(x) __builtin_expect(!!(x), 1)
                                        ^
In file included from include/uapi/linux/stddef.h:1:0,
                 from include/linux/stddef.h:4,
                 from ./include/uapi/linux/posix_types.h:4,
                 from include/uapi/linux/types.h:13,
                 from include/linux/types.h:5,
                 from include/uapi/linux/capability.h:16,
                 from include/linux/capability.h:15,
                 from include/linux/sched.h:15,
                 from include/linux/utsname.h:5,
                 from /var/lib/dkms/nvidia-340/340.76/build/nv-linux.h:44,
                 from /var/lib/dkms/nvidia-340/340.76/build/os-interface.c:15:
./arch/x86/include/asm/uaccess.h: In function ‘copy_from_user’:
./arch/x86/include/asm/uaccess.h:712:26: warning: comparison between signed and unsigned integer expressions [-Wsign-compare]
  if (likely(sz < 0 || sz >= n))
                          ^
include/linux/compiler.h:163:40: note: in definition of macro ‘likely’
 # define likely(x) __builtin_expect(!!(x), 1)
                                        ^
./arch/x86/include/asm/uaccess.h: In function ‘copy_to_user’:
./arch/x86/include/asm/uaccess.h:730:26: warning: comparison between signed and unsigned integer expressions [-Wsign-compare]
  if (likely(sz < 0 || sz >= n))
                          ^
include/linux/compiler.h:163:40: note: in definition of macro ‘likely’
 # define likely(x) __builtin_expect(!!(x), 1)
                                        ^
  if [ "-pg" = "-pg" ]; then if [ /var/lib/dkms/nvidia-340/340.76/build/os-interface.o != "scripts/mod/empty.o" ]; then ./scripts/recordmcount  "/var/lib/dkms/nvidia-340/340.76/build/os-interface.o"; fi; fi;
  cc -Wp,-MD,/var/lib/dkms/nvidia-340/340.76/build/.os-mlock.o.d  -nostdinc -isystem /usr/lib/gcc/x86_64-linux-gnu/4.8/include -I./arch/x86/include -Iarch/x86/include/generated/uapi -Iarch/x86/include/generated  -Iinclude -I./arch/x86/include/uapi -Iarch/x86/include/generated/uapi -I./include/uapi -Iinclude/generated/uapi -include ./include/linux/kconfig.h -D__KERNEL__ -Wall -Wundef -Wstrict-prototypes -Wno-trigraphs -fno-strict-aliasing -fno-common -Werror-implicit-function-declaration -Wno-format-security -std=gnu89 -m64 -mno-80387 -mno-fp-ret-in-387 -mtune=generic -mno-red-zone -mcmodel=kernel -funit-at-a-time -maccumulate-outgoing-args -DCONFIG_X86_X32_ABI -DCONFIG_AS_CFI=1 -DCONFIG_AS_CFI_SIGNAL_FRAME=1 -DCONFIG_AS_CFI_SECTIONS=1 -DCONFIG_AS_FXSAVEQ=1 -DCONFIG_AS_SSSE3=1 -DCONFIG_AS_CRC32=1 -DCONFIG_AS_AVX=1 -DCONFIG_AS_AVX2=1 -pipe -Wno-sign-compare -fno-asynchronous-unwind-tables -mno-sse -mno-mmx -mno-sse2 -mno-3dnow -mno-avx -fno-delete-null-pointer-checks -O2 --param=allow-store-data-races=0 -Wframe-larger-than=1024 -fstack-protector -Wno-unused-but-set-variable -fno-omit-frame-pointer -fno-optimize-sibling-calls -fno-var-tracking-assignments -pg -mfentry -DCC_USING_FENTRY -Wdeclaration-after-statement -Wno-pointer-sign -fno-strict-overflow -fconserve-stack -Werror=implicit-int -Werror=strict-prototypes -DCC_HAVE_ASM_GOTO -DNV_MODULE_INSTANCE=0 -DNV_BUILD_MODULE_INSTANCES=0 -UDEBUG -U_DEBUG -DNDEBUG -I/var/lib/dkms/nvidia-340/340.76/build -Wall -MD -Wsign-compare -Wno-cast-qual -Wno-error -D__KERNEL__ -DMODULE -DNVRM -DNV_VERSION_STRING=\"340.76\" -Wno-unused-function -Wuninitialized -fno-strict-aliasing -mno-red-zone -mcmodel=kernel -DNV_UVM_ENABLE -D__linux__ -DNV_DEV_NAME=\"nvidia\"  -DMODULE  -D"KBUILD_STR(s)=#s" -D"KBUILD_BASENAME=KBUILD_STR(os_mlock)"  -D"KBUILD_MODNAME=KBUILD_STR(nvidia)" -c -o /var/lib/dkms/nvidia-340/340.76/build/.tmp_os-mlock.o /var/lib/dkms/nvidia-340/340.76/build/os-mlock.c
In file included from include/uapi/linux/stddef.h:1:0,
                 from include/linux/stddef.h:4,
                 from ./include/uapi/linux/posix_types.h:4,
                 from include/uapi/linux/types.h:13,
                 from include/linux/types.h:5,
                 from include/uapi/linux/capability.h:16,
                 from include/linux/capability.h:15,
                 from include/linux/sched.h:15,
                 from include/linux/utsname.h:5,
                 from /var/lib/dkms/nvidia-340/340.76/build/nv-linux.h:44,
                 from /var/lib/dkms/nvidia-340/340.76/build/os-mlock.c:15:
include/asm-generic/qrwlock.h: In function ‘queue_write_trylock’:
include/asm-generic/qrwlock.h:93:35: warning: comparison between signed and unsigned integer expressions [-Wsign-compare]
          cnts, cnts | _QW_LOCKED) == cnts);
                                   ^
include/linux/compiler.h:163:40: note: in definition of macro ‘likely’
 # define likely(x) __builtin_expect(!!(x), 1)
                                        ^
In file included from include/uapi/linux/stddef.h:1:0,
                 from include/linux/stddef.h:4,
                 from ./include/uapi/linux/posix_types.h:4,
                 from include/uapi/linux/types.h:13,
                 from include/linux/types.h:5,
                 from include/uapi/linux/capability.h:16,
                 from include/linux/capability.h:15,
                 from include/linux/sched.h:15,
                 from include/linux/utsname.h:5,
                 from /var/lib/dkms/nvidia-340/340.76/build/nv-linux.h:44,
                 from /var/lib/dkms/nvidia-340/340.76/build/os-mlock.c:15:
./arch/x86/include/asm/uaccess.h: In function ‘copy_from_user’:
./arch/x86/include/asm/uaccess.h:712:26: warning: comparison between signed and unsigned integer expressions [-Wsign-compare]
  if (likely(sz < 0 || sz >= n))
                          ^
include/linux/compiler.h:163:40: note: in definition of macro ‘likely’
 # define likely(x) __builtin_expect(!!(x), 1)
                                        ^
./arch/x86/include/asm/uaccess.h: In function ‘copy_to_user’:
./arch/x86/include/asm/uaccess.h:730:26: warning: comparison between signed and unsigned integer expressions [-Wsign-compare]
  if (likely(sz < 0 || sz >= n))
                          ^
include/linux/compiler.h:163:40: note: in definition of macro ‘likely’
 # define likely(x) __builtin_expect(!!(x), 1)
                                        ^
  if [ "-pg" = "-pg" ]; then if [ /var/lib/dkms/nvidia-340/340.76/build/os-mlock.o != "scripts/mod/empty.o" ]; then ./scripts/recordmcount  "/var/lib/dkms/nvidia-340/340.76/build/os-mlock.o"; fi; fi;
  cc -Wp,-MD,/var/lib/dkms/nvidia-340/340.76/build/.os-pci.o.d  -nostdinc -isystem /usr/lib/gcc/x86_64-linux-gnu/4.8/include -I./arch/x86/include -Iarch/x86/include/generated/uapi -Iarch/x86/include/generated  -Iinclude -I./arch/x86/include/uapi -Iarch/x86/include/generated/uapi -I./include/uapi -Iinclude/generated/uapi -include ./include/linux/kconfig.h -D__KERNEL__ -Wall -Wundef -Wstrict-prototypes -Wno-trigraphs -fno-strict-aliasing -fno-common -Werror-implicit-function-declaration -Wno-format-security -std=gnu89 -m64 -mno-80387 -mno-fp-ret-in-387 -mtune=generic -mno-red-zone -mcmodel=kernel -funit-at-a-time -maccumulate-outgoing-args -DCONFIG_X86_X32_ABI -DCONFIG_AS_CFI=1 -DCONFIG_AS_CFI_SIGNAL_FRAME=1 -DCONFIG_AS_CFI_SECTIONS=1 -DCONFIG_AS_FXSAVEQ=1 -DCONFIG_AS_SSSE3=1 -DCONFIG_AS_CRC32=1 -DCONFIG_AS_AVX=1 -DCONFIG_AS_AVX2=1 -pipe -Wno-sign-compare -fno-asynchronous-unwind-tables -mno-sse -mno-mmx -mno-sse2 -mno-3dnow -mno-avx -fno-delete-null-pointer-checks -O2 --param=allow-store-data-races=0 -Wframe-larger-than=1024 -fstack-protector -Wno-unused-but-set-variable -fno-omit-frame-pointer -fno-optimize-sibling-calls -fno-var-tracking-assignments -pg -mfentry -DCC_USING_FENTRY -Wdeclaration-after-statement -Wno-pointer-sign -fno-strict-overflow -fconserve-stack -Werror=implicit-int -Werror=strict-prototypes -DCC_HAVE_ASM_GOTO -DNV_MODULE_INSTANCE=0 -DNV_BUILD_MODULE_INSTANCES=0 -UDEBUG -U_DEBUG -DNDEBUG -I/var/lib/dkms/nvidia-340/340.76/build -Wall -MD -Wsign-compare -Wno-cast-qual -Wno-error -D__KERNEL__ -DMODULE -DNVRM -DNV_VERSION_STRING=\"340.76\" -Wno-unused-function -Wuninitialized -fno-strict-aliasing -mno-red-zone -mcmodel=kernel -DNV_UVM_ENABLE -D__linux__ -DNV_DEV_NAME=\"nvidia\"  -DMODULE  -D"KBUILD_STR(s)=#s" -D"KBUILD_BASENAME=KBUILD_STR(os_pci)"  -D"KBUILD_MODNAME=KBUILD_STR(nvidia)" -c -o /var/lib/dkms/nvidia-340/340.76/build/.tmp_os-pci.o /var/lib/dkms/nvidia-340/340.76/build/os-pci.c
In file included from include/uapi/linux/stddef.h:1:0,
                 from include/linux/stddef.h:4,
                 from ./include/uapi/linux/posix_types.h:4,
                 from include/uapi/linux/types.h:13,
                 from include/linux/types.h:5,
                 from include/uapi/linux/capability.h:16,
                 from include/linux/capability.h:15,
                 from include/linux/sched.h:15,
                 from include/linux/utsname.h:5,
                 from /var/lib/dkms/nvidia-340/340.76/build/nv-linux.h:44,
                 from /var/lib/dkms/nvidia-340/340.76/build/os-pci.c:15:
include/asm-generic/qrwlock.h: In function ‘queue_write_trylock’:
include/asm-generic/qrwlock.h:93:35: warning: comparison between signed and unsigned integer expressions [-Wsign-compare]
          cnts, cnts | _QW_LOCKED) == cnts);
                                   ^
include/linux/compiler.h:163:40: note: in definition of macro ‘likely’
 # define likely(x) __builtin_expect(!!(x), 1)
                                        ^
In file included from include/uapi/linux/stddef.h:1:0,
                 from include/linux/stddef.h:4,
                 from ./include/uapi/linux/posix_types.h:4,
                 from include/uapi/linux/types.h:13,
                 from include/linux/types.h:5,
                 from include/uapi/linux/capability.h:16,
                 from include/linux/capability.h:15,
                 from include/linux/sched.h:15,
                 from include/linux/utsname.h:5,
                 from /var/lib/dkms/nvidia-340/340.76/build/nv-linux.h:44,
                 from /var/lib/dkms/nvidia-340/340.76/build/os-pci.c:15:
./arch/x86/include/asm/uaccess.h: In function ‘copy_from_user’:
./arch/x86/include/asm/uaccess.h:712:26: warning: comparison between signed and unsigned integer expressions [-Wsign-compare]
  if (likely(sz < 0 || sz >= n))
                          ^
include/linux/compiler.h:163:40: note: in definition of macro ‘likely’
 # define likely(x) __builtin_expect(!!(x), 1)
                                        ^
./arch/x86/include/asm/uaccess.h: In function ‘copy_to_user’:
./arch/x86/include/asm/uaccess.h:730:26: warning: comparison between signed and unsigned integer expressions [-Wsign-compare]
  if (likely(sz < 0 || sz >= n))
                          ^
include/linux/compiler.h:163:40: note: in definition of macro ‘likely’
 # define likely(x) __builtin_expect(!!(x), 1)
                                        ^
  if [ "-pg" = "-pg" ]; then if [ /var/lib/dkms/nvidia-340/340.76/build/os-pci.o != "scripts/mod/empty.o" ]; then ./scripts/recordmcount  "/var/lib/dkms/nvidia-340/340.76/build/os-pci.o"; fi; fi;
  cc -Wp,-MD,/var/lib/dkms/nvidia-340/340.76/build/.os-registry.o.d  -nostdinc -isystem /usr/lib/gcc/x86_64-linux-gnu/4.8/include -I./arch/x86/include -Iarch/x86/include/generated/uapi -Iarch/x86/include/generated  -Iinclude -I./arch/x86/include/uapi -Iarch/x86/include/generated/uapi -I./include/uapi -Iinclude/generated/uapi -include ./include/linux/kconfig.h -D__KERNEL__ -Wall -Wundef -Wstrict-prototypes -Wno-trigraphs -fno-strict-aliasing -fno-common -Werror-implicit-function-declaration -Wno-format-security -std=gnu89 -m64 -mno-80387 -mno-fp-ret-in-387 -mtune=generic -mno-red-zone -mcmodel=kernel -funit-at-a-time -maccumulate-outgoing-args -DCONFIG_X86_X32_ABI -DCONFIG_AS_CFI=1 -DCONFIG_AS_CFI_SIGNAL_FRAME=1 -DCONFIG_AS_CFI_SECTIONS=1 -DCONFIG_AS_FXSAVEQ=1 -DCONFIG_AS_SSSE3=1 -DCONFIG_AS_CRC32=1 -DCONFIG_AS_AVX=1 -DCONFIG_AS_AVX2=1 -pipe -Wno-sign-compare -fno-asynchronous-unwind-tables -mno-sse -mno-mmx -mno-sse2 -mno-3dnow -mno-avx -fno-delete-null-pointer-checks -O2 --param=allow-store-data-races=0 -Wframe-larger-than=1024 -fstack-protector -Wno-unused-but-set-variable -fno-omit-frame-pointer -fno-optimize-sibling-calls -fno-var-tracking-assignments -pg -mfentry -DCC_USING_FENTRY -Wdeclaration-after-statement -Wno-pointer-sign -fno-strict-overflow -fconserve-stack -Werror=implicit-int -Werror=strict-prototypes -DCC_HAVE_ASM_GOTO -DNV_MODULE_INSTANCE=0 -DNV_BUILD_MODULE_INSTANCES=0 -UDEBUG -U_DEBUG -DNDEBUG -I/var/lib/dkms/nvidia-340/340.76/build -Wall -MD -Wsign-compare -Wno-cast-qual -Wno-error -D__KERNEL__ -DMODULE -DNVRM -DNV_VERSION_STRING=\"340.76\" -Wno-unused-function -Wuninitialized -fno-strict-aliasing -mno-red-zone -mcmodel=kernel -DNV_UVM_ENABLE -D__linux__ -DNV_DEV_NAME=\"nvidia\"  -DMODULE  -D"KBUILD_STR(s)=#s" -D"KBUILD_BASENAME=KBUILD_STR(os_registry)"  -D"KBUILD_MODNAME=KBUILD_STR(nvidia)" -c -o /var/lib/dkms/nvidia-340/340.76/build/.tmp_os-registry.o /var/lib/dkms/nvidia-340/340.76/build/os-registry.c
In file included from include/uapi/linux/stddef.h:1:0,
                 from include/linux/stddef.h:4,
                 from ./include/uapi/linux/posix_types.h:4,
                 from include/uapi/linux/types.h:13,
                 from include/linux/types.h:5,
                 from include/uapi/linux/capability.h:16,
                 from include/linux/capability.h:15,
                 from include/linux/sched.h:15,
                 from include/linux/utsname.h:5,
                 from /var/lib/dkms/nvidia-340/340.76/build/nv-linux.h:44,
                 from /var/lib/dkms/nvidia-340/340.76/build/os-registry.c:15:
include/asm-generic/qrwlock.h: In function ‘queue_write_trylock’:
include/asm-generic/qrwlock.h:93:35: warning: comparison between signed and unsigned integer expressions [-Wsign-compare]
          cnts, cnts | _QW_LOCKED) == cnts);
                                   ^
include/linux/compiler.h:163:40: note: in definition of macro ‘likely’
 # define likely(x) __builtin_expect(!!(x), 1)
                                        ^
In file included from include/uapi/linux/stddef.h:1:0,
                 from include/linux/stddef.h:4,
                 from ./include/uapi/linux/posix_types.h:4,
                 from include/uapi/linux/types.h:13,
                 from include/linux/types.h:5,
                 from include/uapi/linux/capability.h:16,
                 from include/linux/capability.h:15,
                 from include/linux/sched.h:15,
                 from include/linux/utsname.h:5,
                 from /var/lib/dkms/nvidia-340/340.76/build/nv-linux.h:44,
                 from /var/lib/dkms/nvidia-340/340.76/build/os-registry.c:15:
./arch/x86/include/asm/uaccess.h: In function ‘copy_from_user’:
./arch/x86/include/asm/uaccess.h:712:26: warning: comparison between signed and unsigned integer expressions [-Wsign-compare]
  if (likely(sz < 0 || sz >= n))
                          ^
include/linux/compiler.h:163:40: note: in definition of macro ‘likely’
 # define likely(x) __builtin_expect(!!(x), 1)
                                        ^
./arch/x86/include/asm/uaccess.h: In function ‘copy_to_user’:
./arch/x86/include/asm/uaccess.h:730:26: warning: comparison between signed and unsigned integer expressions [-Wsign-compare]
  if (likely(sz < 0 || sz >= n))
                          ^
include/linux/compiler.h:163:40: note: in definition of macro ‘likely’
 # define likely(x) __builtin_expect(!!(x), 1)
                                        ^
  if [ "-pg" = "-pg" ]; then if [ /var/lib/dkms/nvidia-340/340.76/build/os-registry.o != "scripts/mod/empty.o" ]; then ./scripts/recordmcount  "/var/lib/dkms/nvidia-340/340.76/build/os-registry.o"; fi; fi;
  cc -Wp,-MD,/var/lib/dkms/nvidia-340/340.76/build/.os-smp.o.d  -nostdinc -isystem /usr/lib/gcc/x86_64-linux-gnu/4.8/include -I./arch/x86/include -Iarch/x86/include/generated/uapi -Iarch/x86/include/generated  -Iinclude -I./arch/x86/include/uapi -Iarch/x86/include/generated/uapi -I./include/uapi -Iinclude/generated/uapi -include ./include/linux/kconfig.h -D__KERNEL__ -Wall -Wundef -Wstrict-prototypes -Wno-trigraphs -fno-strict-aliasing -fno-common -Werror-implicit-function-declaration -Wno-format-security -std=gnu89 -m64 -mno-80387 -mno-fp-ret-in-387 -mtune=generic -mno-red-zone -mcmodel=kernel -funit-at-a-time -maccumulate-outgoing-args -DCONFIG_X86_X32_ABI -DCONFIG_AS_CFI=1 -DCONFIG_AS_CFI_SIGNAL_FRAME=1 -DCONFIG_AS_CFI_SECTIONS=1 -DCONFIG_AS_FXSAVEQ=1 -DCONFIG_AS_SSSE3=1 -DCONFIG_AS_CRC32=1 -DCONFIG_AS_AVX=1 -DCONFIG_AS_AVX2=1 -pipe -Wno-sign-compare -fno-asynchronous-unwind-tables -mno-sse -mno-mmx -mno-sse2 -mno-3dnow -mno-avx -fno-delete-null-pointer-checks -O2 --param=allow-store-data-races=0 -Wframe-larger-than=1024 -fstack-protector -Wno-unused-but-set-variable -fno-omit-frame-pointer -fno-optimize-sibling-calls -fno-var-tracking-assignments -pg -mfentry -DCC_USING_FENTRY -Wdeclaration-after-statement -Wno-pointer-sign -fno-strict-overflow -fconserve-stack -Werror=implicit-int -Werror=strict-prototypes -DCC_HAVE_ASM_GOTO -DNV_MODULE_INSTANCE=0 -DNV_BUILD_MODULE_INSTANCES=0 -UDEBUG -U_DEBUG -DNDEBUG -I/var/lib/dkms/nvidia-340/340.76/build -Wall -MD -Wsign-compare -Wno-cast-qual -Wno-error -D__KERNEL__ -DMODULE -DNVRM -DNV_VERSION_STRING=\"340.76\" -Wno-unused-function -Wuninitialized -fno-strict-aliasing -mno-red-zone -mcmodel=kernel -DNV_UVM_ENABLE -D__linux__ -DNV_DEV_NAME=\"nvidia\"  -DMODULE  -D"KBUILD_STR(s)=#s" -D"KBUILD_BASENAME=KBUILD_STR(os_smp)"  -D"KBUILD_MODNAME=KBUILD_STR(nvidia)" -c -o /var/lib/dkms/nvidia-340/340.76/build/.tmp_os-smp.o /var/lib/dkms/nvidia-340/340.76/build/os-smp.c
In file included from include/uapi/linux/stddef.h:1:0,
                 from include/linux/stddef.h:4,
                 from ./include/uapi/linux/posix_types.h:4,
                 from include/uapi/linux/types.h:13,
                 from include/linux/types.h:5,
                 from include/uapi/linux/capability.h:16,
                 from include/linux/capability.h:15,
                 from include/linux/sched.h:15,
                 from include/linux/utsname.h:5,
                 from /var/lib/dkms/nvidia-340/340.76/build/nv-linux.h:44,
                 from /var/lib/dkms/nvidia-340/340.76/build/os-smp.c:15:
include/asm-generic/qrwlock.h: In function ‘queue_write_trylock’:
include/asm-generic/qrwlock.h:93:35: warning: comparison between signed and unsigned integer expressions [-Wsign-compare]
          cnts, cnts | _QW_LOCKED) == cnts);
                                   ^
include/linux/compiler.h:163:40: note: in definition of macro ‘likely’
 # define likely(x) __builtin_expect(!!(x), 1)
                                        ^
In file included from include/uapi/linux/stddef.h:1:0,
                 from include/linux/stddef.h:4,
                 from ./include/uapi/linux/posix_types.h:4,
                 from include/uapi/linux/types.h:13,
                 from include/linux/types.h:5,
                 from include/uapi/linux/capability.h:16,
                 from include/linux/capability.h:15,
                 from include/linux/sched.h:15,
                 from include/linux/utsname.h:5,
                 from /var/lib/dkms/nvidia-340/340.76/build/nv-linux.h:44,
                 from /var/lib/dkms/nvidia-340/340.76/build/os-smp.c:15:
./arch/x86/include/asm/uaccess.h: In function ‘copy_from_user’:
./arch/x86/include/asm/uaccess.h:712:26: warning: comparison between signed and unsigned integer expressions [-Wsign-compare]
  if (likely(sz < 0 || sz >= n))
                          ^
include/linux/compiler.h:163:40: note: in definition of macro ‘likely’
 # define likely(x) __builtin_expect(!!(x), 1)
                                        ^
./arch/x86/include/asm/uaccess.h: In function ‘copy_to_user’:
./arch/x86/include/asm/uaccess.h:730:26: warning: comparison between signed and unsigned integer expressions [-Wsign-compare]
  if (likely(sz < 0 || sz >= n))
                          ^
include/linux/compiler.h:163:40: note: in definition of macro ‘likely’
 # define likely(x) __builtin_expect(!!(x), 1)
                                        ^
  if [ "-pg" = "-pg" ]; then if [ /var/lib/dkms/nvidia-340/340.76/build/os-smp.o != "scripts/mod/empty.o" ]; then ./scripts/recordmcount  "/var/lib/dkms/nvidia-340/340.76/build/os-smp.o"; fi; fi;
  cc -Wp,-MD,/var/lib/dkms/nvidia-340/340.76/build/.os-usermap.o.d  -nostdinc -isystem /usr/lib/gcc/x86_64-linux-gnu/4.8/include -I./arch/x86/include -Iarch/x86/include/generated/uapi -Iarch/x86/include/generated  -Iinclude -I./arch/x86/include/uapi -Iarch/x86/include/generated/uapi -I./include/uapi -Iinclude/generated/uapi -include ./include/linux/kconfig.h -D__KERNEL__ -Wall -Wundef -Wstrict-prototypes -Wno-trigraphs -fno-strict-aliasing -fno-common -Werror-implicit-function-declaration -Wno-format-security -std=gnu89 -m64 -mno-80387 -mno-fp-ret-in-387 -mtune=generic -mno-red-zone -mcmodel=kernel -funit-at-a-time -maccumulate-outgoing-args -DCONFIG_X86_X32_ABI -DCONFIG_AS_CFI=1 -DCONFIG_AS_CFI_SIGNAL_FRAME=1 -DCONFIG_AS_CFI_SECTIONS=1 -DCONFIG_AS_FXSAVEQ=1 -DCONFIG_AS_SSSE3=1 -DCONFIG_AS_CRC32=1 -DCONFIG_AS_AVX=1 -DCONFIG_AS_AVX2=1 -pipe -Wno-sign-compare -fno-asynchronous-unwind-tables -mno-sse -mno-mmx -mno-sse2 -mno-3dnow -mno-avx -fno-delete-null-pointer-checks -O2 --param=allow-store-data-races=0 -Wframe-larger-than=1024 -fstack-protector -Wno-unused-but-set-variable -fno-omit-frame-pointer -fno-optimize-sibling-calls -fno-var-tracking-assignments -pg -mfentry -DCC_USING_FENTRY -Wdeclaration-after-statement -Wno-pointer-sign -fno-strict-overflow -fconserve-stack -Werror=implicit-int -Werror=strict-prototypes -DCC_HAVE_ASM_GOTO -DNV_MODULE_INSTANCE=0 -DNV_BUILD_MODULE_INSTANCES=0 -UDEBUG -U_DEBUG -DNDEBUG -I/var/lib/dkms/nvidia-340/340.76/build -Wall -MD -Wsign-compare -Wno-cast-qual -Wno-error -D__KERNEL__ -DMODULE -DNVRM -DNV_VERSION_STRING=\"340.76\" -Wno-unused-function -Wuninitialized -fno-strict-aliasing -mno-red-zone -mcmodel=kernel -DNV_UVM_ENABLE -D__linux__ -DNV_DEV_NAME=\"nvidia\"  -DMODULE  -D"KBUILD_STR(s)=#s" -D"KBUILD_BASENAME=KBUILD_STR(os_usermap)"  -D"KBUILD_MODNAME=KBUILD_STR(nvidia)" -c -o /var/lib/dkms/nvidia-340/340.76/build/.tmp_os-usermap.o /var/lib/dkms/nvidia-340/340.76/build/os-usermap.c
In file included from include/uapi/linux/stddef.h:1:0,
                 from include/linux/stddef.h:4,
                 from ./include/uapi/linux/posix_types.h:4,
                 from include/uapi/linux/types.h:13,
                 from include/linux/types.h:5,
                 from include/uapi/linux/capability.h:16,
                 from include/linux/capability.h:15,
                 from include/linux/sched.h:15,
                 from include/linux/utsname.h:5,
                 from /var/lib/dkms/nvidia-340/340.76/build/nv-linux.h:44,
                 from /var/lib/dkms/nvidia-340/340.76/build/os-usermap.c:15:
include/asm-generic/qrwlock.h: In function ‘queue_write_trylock’:
include/asm-generic/qrwlock.h:93:35: warning: comparison between signed and unsigned integer expressions [-Wsign-compare]
          cnts, cnts | _QW_LOCKED) == cnts);
                                   ^
include/linux/compiler.h:163:40: note: in definition of macro ‘likely’
 # define likely(x) __builtin_expect(!!(x), 1)
                                        ^
In file included from include/uapi/linux/stddef.h:1:0,
                 from include/linux/stddef.h:4,
                 from ./include/uapi/linux/posix_types.h:4,
                 from include/uapi/linux/types.h:13,
                 from include/linux/types.h:5,
                 from include/uapi/linux/capability.h:16,
                 from include/linux/capability.h:15,
                 from include/linux/sched.h:15,
                 from include/linux/utsname.h:5,
                 from /var/lib/dkms/nvidia-340/340.76/build/nv-linux.h:44,
                 from /var/lib/dkms/nvidia-340/340.76/build/os-usermap.c:15:
./arch/x86/include/asm/uaccess.h: In function ‘copy_from_user’:
./arch/x86/include/asm/uaccess.h:712:26: warning: comparison between signed and unsigned integer expressions [-Wsign-compare]
  if (likely(sz < 0 || sz >= n))
                          ^
include/linux/compiler.h:163:40: note: in definition of macro ‘likely’
 # define likely(x) __builtin_expect(!!(x), 1)
                                        ^
./arch/x86/include/asm/uaccess.h: In function ‘copy_to_user’:
./arch/x86/include/asm/uaccess.h:730:26: warning: comparison between signed and unsigned integer expressions [-Wsign-compare]
  if (likely(sz < 0 || sz >= n))
                          ^
include/linux/compiler.h:163:40: note: in definition of macro ‘likely’
 # define likely(x) __builtin_expect(!!(x), 1)
                                        ^
  if [ "-pg" = "-pg" ]; then if [ /var/lib/dkms/nvidia-340/340.76/build/os-usermap.o != "scripts/mod/empty.o" ]; then ./scripts/recordmcount  "/var/lib/dkms/nvidia-340/340.76/build/os-usermap.o"; fi; fi;
  cc -Wp,-MD,/var/lib/dkms/nvidia-340/340.76/build/.nv_uvm_interface.o.d  -nostdinc -isystem /usr/lib/gcc/x86_64-linux-gnu/4.8/include -I./arch/x86/include -Iarch/x86/include/generated/uapi -Iarch/x86/include/generated  -Iinclude -I./arch/x86/include/uapi -Iarch/x86/include/generated/uapi -I./include/uapi -Iinclude/generated/uapi -include ./include/linux/kconfig.h -D__KERNEL__ -Wall -Wundef -Wstrict-prototypes -Wno-trigraphs -fno-strict-aliasing -fno-common -Werror-implicit-function-declaration -Wno-format-security -std=gnu89 -m64 -mno-80387 -mno-fp-ret-in-387 -mtune=generic -mno-red-zone -mcmodel=kernel -funit-at-a-time -maccumulate-outgoing-args -DCONFIG_X86_X32_ABI -DCONFIG_AS_CFI=1 -DCONFIG_AS_CFI_SIGNAL_FRAME=1 -DCONFIG_AS_CFI_SECTIONS=1 -DCONFIG_AS_FXSAVEQ=1 -DCONFIG_AS_SSSE3=1 -DCONFIG_AS_CRC32=1 -DCONFIG_AS_AVX=1 -DCONFIG_AS_AVX2=1 -pipe -Wno-sign-compare -fno-asynchronous-unwind-tables -mno-sse -mno-mmx -mno-sse2 -mno-3dnow -mno-avx -fno-delete-null-pointer-checks -O2 --param=allow-store-data-races=0 -Wframe-larger-than=1024 -fstack-protector -Wno-unused-but-set-variable -fno-omit-frame-pointer -fno-optimize-sibling-calls -fno-var-tracking-assignments -pg -mfentry -DCC_USING_FENTRY -Wdeclaration-after-statement -Wno-pointer-sign -fno-strict-overflow -fconserve-stack -Werror=implicit-int -Werror=strict-prototypes -DCC_HAVE_ASM_GOTO -DNV_MODULE_INSTANCE=0 -DNV_BUILD_MODULE_INSTANCES=0 -UDEBUG -U_DEBUG -DNDEBUG -I/var/lib/dkms/nvidia-340/340.76/build -Wall -MD -Wsign-compare -Wno-cast-qual -Wno-error -D__KERNEL__ -DMODULE -DNVRM -DNV_VERSION_STRING=\"340.76\" -Wno-unused-function -Wuninitialized -fno-strict-aliasing -mno-red-zone -mcmodel=kernel -DNV_UVM_ENABLE -D__linux__ -DNV_DEV_NAME=\"nvidia\"  -DMODULE  -D"KBUILD_STR(s)=#s" -D"KBUILD_BASENAME=KBUILD_STR(nv_uvm_interface)"  -D"KBUILD_MODNAME=KBUILD_STR(nvidia)" -c -o /var/lib/dkms/nvidia-340/340.76/build/.tmp_nv_uvm_interface.o /var/lib/dkms/nvidia-340/340.76/build/nv_uvm_interface.c
In file included from include/uapi/linux/stddef.h:1:0,
                 from include/linux/stddef.h:4,
                 from ./include/uapi/linux/posix_types.h:4,
                 from include/uapi/linux/types.h:13,
                 from include/linux/types.h:5,
                 from include/uapi/linux/capability.h:16,
                 from include/linux/capability.h:15,
                 from include/linux/sched.h:15,
                 from include/linux/utsname.h:5,
                 from /var/lib/dkms/nvidia-340/340.76/build/nv-linux.h:44,
                 from /var/lib/dkms/nvidia-340/340.76/build/nv_uvm_interface.c:21:
include/asm-generic/qrwlock.h: In function ‘queue_write_trylock’:
include/asm-generic/qrwlock.h:93:35: warning: comparison between signed and unsigned integer expressions [-Wsign-compare]
          cnts, cnts | _QW_LOCKED) == cnts);
                                   ^
include/linux/compiler.h:163:40: note: in definition of macro ‘likely’
 # define likely(x) __builtin_expect(!!(x), 1)
                                        ^
In file included from include/uapi/linux/stddef.h:1:0,
                 from include/linux/stddef.h:4,
                 from ./include/uapi/linux/posix_types.h:4,
                 from include/uapi/linux/types.h:13,
                 from include/linux/types.h:5,
                 from include/uapi/linux/capability.h:16,
                 from include/linux/capability.h:15,
                 from include/linux/sched.h:15,
                 from include/linux/utsname.h:5,
                 from /var/lib/dkms/nvidia-340/340.76/build/nv-linux.h:44,
                 from /var/lib/dkms/nvidia-340/340.76/build/nv_uvm_interface.c:21:
./arch/x86/include/asm/uaccess.h: In function ‘copy_from_user’:
./arch/x86/include/asm/uaccess.h:712:26: warning: comparison between signed and unsigned integer expressions [-Wsign-compare]
  if (likely(sz < 0 || sz >= n))
                          ^
include/linux/compiler.h:163:40: note: in definition of macro ‘likely’
 # define likely(x) __builtin_expect(!!(x), 1)
                                        ^
./arch/x86/include/asm/uaccess.h: In function ‘copy_to_user’:
./arch/x86/include/asm/uaccess.h:730:26: warning: comparison between signed and unsigned integer expressions [-Wsign-compare]
  if (likely(sz < 0 || sz >= n))
                          ^
include/linux/compiler.h:163:40: note: in definition of macro ‘likely’
 # define likely(x) __builtin_expect(!!(x), 1)
                                        ^
  if [ "-pg" = "-pg" ]; then if [ /var/lib/dkms/nvidia-340/340.76/build/nv_uvm_interface.o != "scripts/mod/empty.o" ]; then ./scripts/recordmcount  "/var/lib/dkms/nvidia-340/340.76/build/nv_uvm_interface.o"; fi; fi;
  cc -Wp,-MD,/var/lib/dkms/nvidia-340/340.76/build/.nv-frontend.o.d  -nostdinc -isystem /usr/lib/gcc/x86_64-linux-gnu/4.8/include -I./arch/x86/include -Iarch/x86/include/generated/uapi -Iarch/x86/include/generated  -Iinclude -I./arch/x86/include/uapi -Iarch/x86/include/generated/uapi -I./include/uapi -Iinclude/generated/uapi -include ./include/linux/kconfig.h -D__KERNEL__ -Wall -Wundef -Wstrict-prototypes -Wno-trigraphs -fno-strict-aliasing -fno-common -Werror-implicit-function-declaration -Wno-format-security -std=gnu89 -m64 -mno-80387 -mno-fp-ret-in-387 -mtune=generic -mno-red-zone -mcmodel=kernel -funit-at-a-time -maccumulate-outgoing-args -DCONFIG_X86_X32_ABI -DCONFIG_AS_CFI=1 -DCONFIG_AS_CFI_SIGNAL_FRAME=1 -DCONFIG_AS_CFI_SECTIONS=1 -DCONFIG_AS_FXSAVEQ=1 -DCONFIG_AS_SSSE3=1 -DCONFIG_AS_CRC32=1 -DCONFIG_AS_AVX=1 -DCONFIG_AS_AVX2=1 -pipe -Wno-sign-compare -fno-asynchronous-unwind-tables -mno-sse -mno-mmx -mno-sse2 -mno-3dnow -mno-avx -fno-delete-null-pointer-checks -O2 --param=allow-store-data-races=0 -Wframe-larger-than=1024 -fstack-protector -Wno-unused-but-set-variable -fno-omit-frame-pointer -fno-optimize-sibling-calls -fno-var-tracking-assignments -pg -mfentry -DCC_USING_FENTRY -Wdeclaration-after-statement -Wno-pointer-sign -fno-strict-overflow -fconserve-stack -Werror=implicit-int -Werror=strict-prototypes -DCC_HAVE_ASM_GOTO -DNV_MODULE_INSTANCE=0 -DNV_BUILD_MODULE_INSTANCES=0 -UDEBUG -U_DEBUG -DNDEBUG -I/var/lib/dkms/nvidia-340/340.76/build -Wall -MD -Wsign-compare -Wno-cast-qual -Wno-error -D__KERNEL__ -DMODULE -DNVRM -DNV_VERSION_STRING=\"340.76\" -Wno-unused-function -Wuninitialized -fno-strict-aliasing -mno-red-zone -mcmodel=kernel -DNV_UVM_ENABLE -D__linux__ -DNV_DEV_NAME=\"nvidia\"  -DMODULE  -D"KBUILD_STR(s)=#s" -D"KBUILD_BASENAME=KBUILD_STR(nv_frontend)"  -D"KBUILD_MODNAME=KBUILD_STR(nvidia)" -c -o /var/lib/dkms/nvidia-340/340.76/build/.tmp_nv-frontend.o /var/lib/dkms/nvidia-340/340.76/build/nv-frontend.c
In file included from include/uapi/linux/stddef.h:1:0,
                 from include/linux/stddef.h:4,
                 from ./include/uapi/linux/posix_types.h:4,
                 from include/uapi/linux/types.h:13,
                 from include/linux/types.h:5,
                 from include/uapi/linux/capability.h:16,
                 from include/linux/capability.h:15,
                 from include/linux/sched.h:15,
                 from include/linux/utsname.h:5,
                 from /var/lib/dkms/nvidia-340/340.76/build/nv-linux.h:44,
                 from /var/lib/dkms/nvidia-340/340.76/build/nv-frontend.c:13:
include/asm-generic/qrwlock.h: In function ‘queue_write_trylock’:
include/asm-generic/qrwlock.h:93:35: warning: comparison between signed and unsigned integer expressions [-Wsign-compare]
          cnts, cnts | _QW_LOCKED) == cnts);
                                   ^
include/linux/compiler.h:163:40: note: in definition of macro ‘likely’
 # define likely(x) __builtin_expect(!!(x), 1)
                                        ^
In file included from include/uapi/linux/stddef.h:1:0,
                 from include/linux/stddef.h:4,
                 from ./include/uapi/linux/posix_types.h:4,
                 from include/uapi/linux/types.h:13,
                 from include/linux/types.h:5,
                 from include/uapi/linux/capability.h:16,
                 from include/linux/capability.h:15,
                 from include/linux/sched.h:15,
                 from include/linux/utsname.h:5,
                 from /var/lib/dkms/nvidia-340/340.76/build/nv-linux.h:44,
                 from /var/lib/dkms/nvidia-340/340.76/build/nv-frontend.c:13:
./arch/x86/include/asm/uaccess.h: In function ‘copy_from_user’:
./arch/x86/include/asm/uaccess.h:712:26: warning: comparison between signed and unsigned integer expressions [-Wsign-compare]
  if (likely(sz < 0 || sz >= n))
                          ^
include/linux/compiler.h:163:40: note: in definition of macro ‘likely’
 # define likely(x) __builtin_expect(!!(x), 1)
                                        ^
./arch/x86/include/asm/uaccess.h: In function ‘copy_to_user’:
./arch/x86/include/asm/uaccess.h:730:26: warning: comparison between signed and unsigned integer expressions [-Wsign-compare]
  if (likely(sz < 0 || sz >= n))
                          ^
include/linux/compiler.h:163:40: note: in definition of macro ‘likely’
 # define likely(x) __builtin_expect(!!(x), 1)
                                        ^
  if [ "-pg" = "-pg" ]; then if [ /var/lib/dkms/nvidia-340/340.76/build/nv-frontend.o != "scripts/mod/empty.o" ]; then ./scripts/recordmcount  "/var/lib/dkms/nvidia-340/340.76/build/nv-frontend.o"; fi; fi;
(cat /dev/null;   echo kernel//var/lib/dkms/nvidia-340/340.76/build/nvidia.ko;) > /var/lib/dkms/nvidia-340/340.76/build/modules.order
make[2]: Target `__build' not remade because of errors.
make[1]: *** [_module_/var/lib/dkms/nvidia-340/340.76/build] Error 2
make[1]: Target `modules' not remade because of errors.
make[1]: Leaving directory `/usr/src/linux-headers-4.1.6-040106-generic'
NVIDIA: left KBUILD.
nvidia.ko failed to build!
make: *** [nvidia.ko] Error 1
make: Target `module' not remade because of errors.
make: Entering directory `/var/lib/dkms/nvidia-340/340.76/build/uvm'
cd ./..; make module SYSSRC=/lib/modules/4.1.6-040106-generic/build SYSOUT=/lib/modules/4.1.6-040106-generic/build KBUILD_EXTMOD=./..
make[1]: Entering directory `/var/lib/dkms/nvidia-340/340.76/build'
NVIDIA: calling KBUILD...
make[2]: Entering directory `/usr/src/linux-headers-4.1.6-040106-generic'
test -e include/generated/autoconf.h -a -e include/config/auto.conf || (		\
	echo >&2;							\
	echo >&2 "  ERROR: Kernel configuration is invalid.";		\
	echo >&2 "         include/generated/autoconf.h or include/config/auto.conf are missing.";\
	echo >&2 "         Run 'make oldconfig && make prepare' on kernel src to fix it.";	\
	echo >&2 ;							\
	/bin/false)
mkdir -p ./../.tmp_versions ; rm -f ./../.tmp_versions/*
make -f ./scripts/Makefile.build obj=./..
./scripts/Makefile.build:44: ../Makefile: No such file or directory
make[3]: *** No rule to make target `../Makefile'.  Stop.
make[2]: *** [_module_./..] Error 2
make[2]: Leaving directory `/usr/src/linux-headers-4.1.6-040106-generic'
NVIDIA: left KBUILD.
nvidia.ko failed to build!
make[1]: *** [nvidia.ko] Error 1
make[1]: Leaving directory `/var/lib/dkms/nvidia-340/340.76/build'
make: *** [../Module.symvers] Error 2
make: Leaving directory `/var/lib/dkms/nvidia-340/340.76/build/uvm'